{"text_format":"3","workbook":"xlsx","n_sheets":14,"sheets":["CODICI","LINGUA","GRAFICI","DESIGN","SELECTION","OFFER","Steam absoprtion distance-AUTO","TENDER TEXT","Steam absoprtion distance ","Currencies","Potenze","Commissioning","DP","release"],"not_rendered":{"charts":1,"images":5,"macros":1,"external_links":1,"defined_names":141,"comments":5},"read":"whole","date_system":"1900"}

{"sheet":"CODICI","index":0,"n_rows":457,"n_cols":6,"rows_kept":457,"hidden":true}
[null,"2016 price list"]
[null,"Climate",null,"INSTRUCTIONS :"]
[null,"valid from January 1st 2016",null,"If needed change the prices in the grey cells"]
[]
[null,"Code","Description","Price list 2016",null,"Price (selected currency)"]
[1,"DP035D22R0",{"$f":"VLOOKUP(B6,LINGUA!$B:$H,2,0)","v":"Stainless steel steam distributor, inlet  Ø=22 mm, l = 350 mm"},{"v":74.6,"d":"€ 74.60"},null,{"$f":"IF(SELECTION!$C$46=\"Eur\",CODICI!D6,CODICI!D6*SELECTION!$C$48)","v":{"v":74.6,"d":"€ 74.60"}}]
[{"$f":"+A6+1","v":2},"DP045D22R0",{"$f":"VLOOKUP(B7,LINGUA!$B:$H,2,0)","v":"Stainless steel steam distributor, inlet  Ø=22 mm, l = 450 mm"},{"v":85.1,"d":"€ 85.10"},null,{"$f":"IF(SELECTION!$C$46=\"Eur\",CODICI!D7,CODICI!D7*SELECTION!$C$48)","v":{"v":85.1,"d":"€ 85.10"}}]
[{"$f":"+A7+1","v":3},"DP060D22R0",{"$f":"VLOOKUP(B8,LINGUA!$B:$H,2,0)","v":"Stainless steel steam distributor, inlet  Ø=22 mm, l = 600 mm"},{"v":92.5,"d":"€ 92.50"},null,{"$f":"IF(SELECTION!$C$46=\"Eur\",CODICI!D8,CODICI!D8*SELECTION!$C$48)","v":{"v":92.5,"d":"€ 92.50"}}]
[4,"DP085D22R0",{"$f":"VLOOKUP(B9,LINGUA!$B:$H,2,0)","v":"Stainless steel steam distributor, inlet  Ø=22 mm, l = 850 mm"},{"v":114.5,"d":"€ 114.50"},null,{"$f":"IF(SELECTION!$C$46=\"Eur\",CODICI!D9,CODICI!D9*SELECTION!$C$48)","v":{"v":114.5,"d":"€ 114.50"}}]
[5,"DP035D30R0",{"$f":"VLOOKUP(B10,LINGUA!$B:$H,2,0)","v":"Stainless steel steam distributor, inlet  Ø=30 mm, l = 350 mm"},{"v":85.1,"d":"€ 85.10"},null,{"$f":"IF(SELECTION!$C$46=\"Eur\",CODICI!D10,CODICI!D10*SELECTION!$C$48)","v":{"v":85.1,"d":"€ 85.10"}}]
[6,"DP045D30R0",{"$f":"VLOOKUP(B11,LINGUA!$B:$H,2,0)","v":"Stainless steel steam distributor, inlet  Ø=30 mm, l = 450 mm"},{"v":103,"d":"€ 103.00"},null,{"$f":"IF(SELECTION!$C$46=\"Eur\",CODICI!D11,CODICI!D11*SELECTION!$C$48)","v":{"v":103,"d":"€ 103.00"}}]
[7,"DP060D30R0",{"$f":"VLOOKUP(B12,LINGUA!$B:$H,2,0)","v":"Stainless steel steam distributor, inlet  Ø=30 mm, l = 600 mm"},{"v":114.5,"d":"€ 114.50"},null,{"$f":"IF(SELECTION!$C$46=\"Eur\",CODICI!D12,CODICI!D12*SELECTION!$C$48)","v":{"v":114.5,"d":"€ 114.50"}}]
[8,"DP085D30R0",{"$f":"VLOOKUP(B13,LINGUA!$B:$H,2,0)","v":"Stainless steel steam distributor, inlet  Ø=30 mm, l = 850 mm"},{"v":140.8,"d":"€ 140.80"},null,{"$f":"IF(SELECTION!$C$46=\"Eur\",CODICI!D13,CODICI!D13*SELECTION!$C$48)","v":{"v":140.8,"d":"€ 140.80"}}]
[9,"DP105D30R0",{"$f":"VLOOKUP(B14,LINGUA!$B:$H,2,0)","v":"Stainless steel steam distributor, inlet  Ø=30 mm, l = 1,050 mm"},{"v":152.3,"d":"€ 152.30"},null,{"$f":"IF(SELECTION!$C$46=\"Eur\",CODICI!D14,CODICI!D14*SELECTION!$C$48)","v":{"v":152.3,"d":"€ 152.30"}}]
[10,"DP125D30R0",{"$f":"VLOOKUP(B15,LINGUA!$B:$H,2,0)","v":"Stainless steel steam distributor, inlet  Ø=30 mm, l = 1,250 mm"},{"v":157.6,"d":"€ 157.60"},null,{"$f":"IF(SELECTION!$C$46=\"Eur\",CODICI!D15,CODICI!D15*SELECTION!$C$48)","v":{"v":157.6,"d":"€ 157.60"}}]
[11,"DP165D30R0",{"$f":"VLOOKUP(B16,LINGUA!$B:$H,2,0)","v":"Stainless steel steam distributor, inlet  Ø=30 mm, l = 1.650 mm"},{"v":162.8,"d":"€ 162.80"},null,{"$f":"IF(SELECTION!$C$46=\"Eur\",CODICI!D16,CODICI!D16*SELECTION!$C$48)","v":{"v":162.8,"d":"€ 162.80"}}]
[12,"DP085D40R0",{"$f":"VLOOKUP(B17,LINGUA!$B:$H,2,0)","v":"Stainless steel steam distributor, inlet  Ø=40 mm, l = 850 mm"},{"v":200.6,"d":"€ 200.60"},null,{"$f":"IF(SELECTION!$C$46=\"Eur\",CODICI!D17,CODICI!D17*SELECTION!$C$48)","v":{"v":200.6,"d":"€ 200.60"}}]
[13,"DP105D40R0",{"$f":"VLOOKUP(B18,LINGUA!$B:$H,2,0)","v":"Stainless steel steam distributor, inlet  Ø=40 mm, l = 1,050 mm"},{"v":216.4,"d":"€ 216.40"},null,{"$f":"IF(SELECTION!$C$46=\"Eur\",CODICI!D18,CODICI!D18*SELECTION!$C$48)","v":{"v":216.4,"d":"€ 216.40"}}]
[14,"DP125D40R0",{"$f":"VLOOKUP(B19,LINGUA!$B:$H,2,0)","v":"Stainless steel steam distributor, inlet  Ø=40 mm, l = 1,250 mm"},{"v":227.9,"d":"€ 227.90"},null,{"$f":"IF(SELECTION!$C$46=\"Eur\",CODICI!D19,CODICI!D19*SELECTION!$C$48)","v":{"v":227.9,"d":"€ 227.90"}}]
[15,"DP165D40R0",{"$f":"VLOOKUP(B20,LINGUA!$B:$H,2,0)","v":"Stainless steel steam distributor, inlet  Ø=40 mm, l = 1,650 mm"},{"v":271.1,"d":"€ 271.10"},null,{"$f":"IF(SELECTION!$C$46=\"Eur\",CODICI!D20,CODICI!D20*SELECTION!$C$48)","v":{"v":271.1,"d":"€ 271.10"}}]
[16,"DP205D40R0",{"$f":"VLOOKUP(B21,LINGUA!$B:$H,2,0)","v":"Stainless steel steam distributor, inlet  Ø=40 mm, l = 2,050 mm"},{"v":324.7,"d":"€ 324.70"},null,{"$f":"IF(SELECTION!$C$46=\"Eur\",CODICI!D21,CODICI!D21*SELECTION!$C$48)","v":{"v":324.7,"d":"€ 324.70"}}]
[17,"DP030D22RU",{"$f":"VLOOKUP(B22,LINGUA!$B:$H,2,0)","v":"Stainless steel steam distributor, inlet Ø=22 mm, l = 300 mm"},{"v":74.6,"d":"€ 74.60"},null,{"$f":"IF(SELECTION!$C$46=\"Eur\",CODICI!D22,CODICI!D22*SELECTION!$C$48)","v":{"v":74.6,"d":"€ 74.60"}}]
[18,"DP030D30RU",{"$f":"VLOOKUP(B23,LINGUA!$B:$H,2,0)","v":"Stainless steel steam distributor, inlet  Ø=30 mm, l = 300 mm"},{"v":85.1,"d":"€ 85.10"},null,{"$f":"IF(SELECTION!$C$46=\"Eur\",CODICI!D23,CODICI!D23*SELECTION!$C$48)","v":{"v":85.1,"d":"€ 85.10"}}]
[19,"DP045D30RU",{"$f":"VLOOKUP(B24,LINGUA!$B:$H,2,0)","v":"Stainless steel steam distributor, inlet  Ø=30 mm, l = 450 mm"},{"v":103,"d":"€ 103.00"},null,{"$f":"IF(SELECTION!$C$46=\"Eur\",CODICI!D24,CODICI!D24*SELECTION!$C$48)","v":{"v":103,"d":"€ 103.00"}}]
[20,"DP060D30RU",{"$f":"VLOOKUP(B25,LINGUA!$B:$H,2,0)","v":"Stainless steel steam distributor, inlet  Ø=30 mm, l = 600 mm"},{"v":114.5,"d":"€ 114.50"},null,{"$f":"IF(SELECTION!$C$46=\"Eur\",CODICI!D25,CODICI!D25*SELECTION!$C$48)","v":{"v":114.5,"d":"€ 114.50"}}]
[21,"DP060D40RU",{"$f":"VLOOKUP(B26,LINGUA!$B:$H,2,0)","v":"Stainless steel steam distributor, inlet  Ø=40 mm, l = 600 mm"},{"v":162.8,"d":"€ 162.80"},null,{"$f":"IF(SELECTION!$C$46=\"Eur\",CODICI!D26,CODICI!D26*SELECTION!$C$48)","v":{"v":162.8,"d":"€ 162.80"}}]
[22,"SDPOEM0012",{"$f":"VLOOKUP(B27,LINGUA!$B:$H,2,0)","v":"SDP OEM: steam injection nozzle up to 3 kg/h"},{"v":32.5,"d":"€ 32.50"},null,{"$f":"IF(SELECTION!$C$46=\"Eur\",CODICI!D27,CODICI!D27*SELECTION!$C$48)","v":{"v":32.5,"d":"€ 32.50"}}]
[23,"SDPOEM0022",{"$f":"VLOOKUP(B28,LINGUA!$B:$H,2,0)","v":"SDP OEM: steam injection nozzle from 3 to 15 kg/h"},{"v":32.5,"d":"€ 32.50"},null,{"$f":"IF(SELECTION!$C$46=\"Eur\",CODICI!D28,CODICI!D28*SELECTION!$C$48)","v":{"v":32.5,"d":"€ 32.50"}}]
[24,"SDPOEM0000",{"$f":"VLOOKUP(B29,LINGUA!$B:$H,2,0)","v":"SDP OEM: customizable steam injection nozzle"},{"v":32.5,"d":"€ 32.50"},null,{"$f":"IF(SELECTION!$C$46=\"Eur\",CODICI!D29,CODICI!D29*SELECTION!$C$48)","v":{"v":32.5,"d":"€ 32.50"}}]
[25,"UEKY000000",{"$f":"VLOOKUP(B30,LINGUA!$B:$H,2,0)","v":"‘Y’ connector for steam hoses (from 1x Ø=40 mm to 2x Ø=30 mm)"},{"v":131.5,"d":"€ 131.50"},null,{"$f":"IF(SELECTION!$C$46=\"Eur\",CODICI!D30,CODICI!D30*SELECTION!$C$48)","v":{"v":131.5,"d":"€ 131.50"}}]
[26,"UEKY40X400",{"$f":"VLOOKUP(B31,LINGUA!$B:$H,2,0)","v":"‘Y’ connector for steam hoses (from 1x Ø=40 mm to 2x Ø=40 mm)"},{"v":136.9,"d":"€ 136.90"},null,{"$f":"IF(SELECTION!$C$46=\"Eur\",CODICI!D31,CODICI!D31*SELECTION!$C$48)","v":{"v":136.9,"d":"€ 136.90"}}]
[27,"1312360AXX",{"$f":"VLOOKUP(B32,LINGUA!$B:$H,2,0)","v":"Steam hose with steel spring Ø=22 mm (per metre)"},{"v":30.8,"d":"€ 30.80"},null,{"$f":"IF(SELECTION!$C$46=\"Eur\",CODICI!D32,CODICI!D32*SELECTION!$C$48)","v":{"v":30.8,"d":"€ 30.80"}}]
[28,"1312365AXX",{"$f":"VLOOKUP(B33,LINGUA!$B:$H,2,0)","v":"Steam hose with steel spring Ø=30 mm (per meter)"},{"v":38.2,"d":"€ 38.20"},null,{"$f":"IF(SELECTION!$C$46=\"Eur\",CODICI!D33,CODICI!D33*SELECTION!$C$48)","v":{"v":38.2,"d":"€ 38.20"}}]
[29,"1312367AXX",{"$f":"VLOOKUP(B34,LINGUA!$B:$H,2,0)","v":"Steam hose with steel spring Ø=40 mm (per metre)"},{"v":57.3,"d":"€ 57.30"},null,{"$f":"IF(SELECTION!$C$46=\"Eur\",CODICI!D34,CODICI!D34*SELECTION!$C$48)","v":{"v":57.3,"d":"€ 57.30"}}]
[30,"FWH3415003",{"$f":"VLOOKUP(B35,LINGUA!$B:$H,2,0)","v":"Water fill hose l = 1.5 m with 3/4” fitting "},{"v":16,"d":"€ 16.00"},null,{"$f":"IF(SELECTION!$C$46=\"Eur\",CODICI!D35,CODICI!D35*SELECTION!$C$48)","v":{"v":16,"d":"€ 16.00"}}]
[31,"FWH3430003",{"$f":"VLOOKUP(B36,LINGUA!$B:$H,2,0)","v":"Water fill hose l = 3 m with 3/4” fitting "},{"v":23.4,"d":"€ 23.40"},null,{"$f":"IF(SELECTION!$C$46=\"Eur\",CODICI!D36,CODICI!D36*SELECTION!$C$48)","v":{"v":23.4,"d":"€ 23.40"}}]
[32,"FWHDCV0003",{"$f":"VLOOKUP(B37,LINGUA!$B:$H,2,0)","v":"Water fill hose with dual-check valve (included from UE065 to UE130)"},{"v":41.4,"d":"€ 41.40"},null,{"$f":"IF(SELECTION!$C$46=\"Eur\",CODICI!D37,CODICI!D37*SELECTION!$C$48)","v":{"v":41.4,"d":"€ 41.40"}}]
[33,"1312353APG",{"$f":"VLOOKUP(B38,LINGUA!$B:$H,2,0)","v":"SFC 006: condensate drain hose Ø=7 mm (per metre)"},{"v":6.4,"d":"€ 6.40"},null,{"$f":"IF(SELECTION!$C$46=\"Eur\",CODICI!D38,CODICI!D38*SELECTION!$C$48)","v":{"v":6.4,"d":"€ 6.40"}}]
[34,"1312368AXX",{"$f":"VLOOKUP(B39,LINGUA!$B:$H,2,0)","v":"condensate drain hose Ø=10 mm (per metre)"},{"v":8.4,"d":"€ 8.40"},null,{"$f":"IF(SELECTION!$C$46=\"Eur\",CODICI!D39,CODICI!D39*SELECTION!$C$48)","v":{"v":8.4,"d":"€ 8.40"}}]
[35,"DPWC112000",{"$f":"VLOOKUP(B40,LINGUA!$B:$H,2,0)","v":"Active wall mounting sensor: Temperature (-10T60 °C) and humidity (10 to 90% rH)"},{"v":99,"d":"€ 99.00"},null,{"$f":"IF(SELECTION!$C$46=\"Eur\",CODICI!D40,CODICI!D40*SELECTION!$C$48)","v":{"v":99,"d":"€ 99.00"}}]
[36,"DPPC112000",{"$f":"VLOOKUP(B41,LINGUA!$B:$H,2,0)","v":"Active sensor for industrial environments: Temperature (-20T70 °C) and humidity (10 to 90% rH)"},{"v":164.5,"d":"€ 164.50"},null,{"$f":"IF(SELECTION!$C$46=\"Eur\",CODICI!D41,CODICI!D41*SELECTION!$C$48)","v":{"v":164.5,"d":"€ 164.50"}}]
[37,"DPPC212000",{"$f":"VLOOKUP(B42,LINGUA!$B:$H,2,0)","v":"Active sensor for industrial environments: Temperature (-20T70 °C) and humidity (0 to 100% rH)"},{"v":257,"d":"€ 257.00"},null,{"$f":"IF(SELECTION!$C$46=\"Eur\",CODICI!D42,CODICI!D42*SELECTION!$C$48)","v":{"v":257,"d":"€ 257.00"}}]
[38,"DPDC112000",{"$f":"VLOOKUP(B43,LINGUA!$B:$H,2,0)","v":"Active sensor for ducts: Temperature (-20T70 °C) and humidity (10 to 90% rH)"},{"v":164.5,"d":"€ 164.50"},null,{"$f":"IF(SELECTION!$C$46=\"Eur\",CODICI!D43,CODICI!D43*SELECTION!$C$48)","v":{"v":164.5,"d":"€ 164.50"}}]
[39,"DPDC212000",{"$f":"VLOOKUP(B44,LINGUA!$B:$H,2,0)","v":"Active sensor for ducts: Temperature (-20T70 °C) and humidity (0 to 100% rH)"},{"v":257,"d":"€ 257.00"},null,{"$f":"IF(SELECTION!$C$46=\"Eur\",CODICI!D44,CODICI!D44*SELECTION!$C$48)","v":{"v":257,"d":"€ 257.00"}}]
[40,"ASET030001",{"$f":"VLOOKUP(B45,LINGUA!$B:$H,2,0)","v":"Temperature probe (-30T90 °C) for universal use"},{"v":75.5,"d":"€ 75.50"},null,{"$f":"IF(SELECTION!$C$46=\"Eur\",CODICI!D45,CODICI!D45*SELECTION!$C$48)","v":{"v":75.5,"d":"€ 75.50"}}]
[41,"UE001YD001",{"$f":"VLOOKUP(B46,LINGUA!$B:$H,2,0)","v":"humiSteam Basic 1,5 kg/h, 230V 1~, ON/OFF or proportional, disposable cylinder"},{"v":903,"d":"€ 903.00"},null,{"$f":"IF(SELECTION!$C$46=\"Eur\",CODICI!D46,CODICI!D46*SELECTION!$C$48)","v":{"v":903,"d":"€ 903.00"}}]
[42,"UE001YDC01",{"$f":"VLOOKUP(B47,LINGUA!$B:$H,2,0)","v":"humiSteam Basic 1,5 kg/h, 230V 1~, ON/OFF or proportional, cleanable cylinder"},{"v":946,"d":"€ 946.00"},null,{"$f":"IF(SELECTION!$C$46=\"Eur\",CODICI!D47,CODICI!D47*SELECTION!$C$48)","v":{"v":946,"d":"€ 946.00"}}]
[43,"UE001YU001",{"$f":"VLOOKUP(B48,LINGUA!$B:$H,2,0)","v":"humiSteam Basic 1,5 kg/h, 208V 1~, ON/OFF or proportional, disposable cylinder"},{"v":903,"d":"€ 903.00"},null,{"$f":"IF(SELECTION!$C$46=\"Eur\",CODICI!D48,CODICI!D48*SELECTION!$C$48)","v":{"v":903,"d":"€ 903.00"}}]
[44,"UE001YUC01",{"$f":"VLOOKUP(B49,LINGUA!$B:$H,2,0)","v":"humiSteam Basic 1,5 kg/h, 208V 1~, ON/OFF or proportional, cleanable cylinder"},{"v":946,"d":"€ 946.00"},null,{"$f":"IF(SELECTION!$C$46=\"Eur\",CODICI!D49,CODICI!D49*SELECTION!$C$48)","v":{"v":946,"d":"€ 946.00"}}]
[45,"UE003YD001",{"$f":"VLOOKUP(B50,LINGUA!$B:$H,2,0)","v":"humiSteam Basic 3 kg/h, 230V 1~, ON/OFF or proportional, disposable cylinder"},{"v":1029,"d":"€ 1,029.00"},null,{"$f":"IF(SELECTION!$C$46=\"Eur\",CODICI!D50,CODICI!D50*SELECTION!$C$48)","v":{"v":1029,"d":"€ 1,029.00"}}]
[46,"UE003YDC01",{"$f":"VLOOKUP(B51,LINGUA!$B:$H,2,0)","v":"humiSteam Basic 3 kg/h, 230V 1~, ON/OFF or proportional, cleanable cylinder"},{"v":1067,"d":"€ 1,067.00"},null,{"$f":"IF(SELECTION!$C$46=\"Eur\",CODICI!D51,CODICI!D51*SELECTION!$C$48)","v":{"v":1067,"d":"€ 1,067.00"}}]
[47,"UE003YK001",{"$f":"VLOOKUP(B52,LINGUA!$B:$H,2,0)","v":"humiSteam Basic 3 kg/h, 230V 3~, ON/OFF or proportional, disposable cylinder"},{"v":1030,"d":"€ 1,030.00"},null,{"$f":"IF(SELECTION!$C$46=\"Eur\",CODICI!D52,CODICI!D52*SELECTION!$C$48)","v":{"v":1030,"d":"€ 1,030.00"}}]
[48,"UE003YKC01",{"$f":"VLOOKUP(B53,LINGUA!$B:$H,2,0)","v":"humiSteam Basic 3 kg/h, 230V 3~, ON/OFF or proportional, cleanable cylinder"},{"v":1060,"d":"€ 1,060.00"},null,{"$f":"IF(SELECTION!$C$46=\"Eur\",CODICI!D53,CODICI!D53*SELECTION!$C$48)","v":{"v":1060,"d":"€ 1,060.00"}}]
[49,"UE003YL001",{"$f":"VLOOKUP(B54,LINGUA!$B:$H,2,0)","v":"humiSteam Basic 3 kg/h, 400V 3~, ON/OFF or proportional, disposable cylinder"},{"v":1029,"d":"€ 1,029.00"},null,{"$f":"IF(SELECTION!$C$46=\"Eur\",CODICI!D54,CODICI!D54*SELECTION!$C$48)","v":{"v":1029,"d":"€ 1,029.00"}}]
[50,"UE003YLC01",{"$f":"VLOOKUP(B55,LINGUA!$B:$H,2,0)","v":"humiSteam Basic 3 kg/h, 400V 3~, ON/OFF or proportional, cleanable cylinder"},{"v":1060,"d":"€ 1,060.00"},null,{"$f":"IF(SELECTION!$C$46=\"Eur\",CODICI!D55,CODICI!D55*SELECTION!$C$48)","v":{"v":1060,"d":"€ 1,060.00"}}]
[51,"UE003YM001",{"$f":"VLOOKUP(B56,LINGUA!$B:$H,2,0)","v":"humiSteam Basic 3 kg/h, 460V 3~, ON/OFF or proportional, disposable cylinder"},{"v":1030,"d":"€ 1,030.00"},null,{"$f":"IF(SELECTION!$C$46=\"Eur\",CODICI!D56,CODICI!D56*SELECTION!$C$48)","v":{"v":1030,"d":"€ 1,030.00"}}]
[52,"UE003YMC01",{"$f":"VLOOKUP(B57,LINGUA!$B:$H,2,0)","v":"humiSteam Basic 3 kg/h, 460V 3~, ON/OFF or proportional, cleanable cylinder"},{"v":1060,"d":"€ 1,060.00"},null,{"$f":"IF(SELECTION!$C$46=\"Eur\",CODICI!D57,CODICI!D57*SELECTION!$C$48)","v":{"v":1060,"d":"€ 1,060.00"}}]
[53,"UE003YU001",{"$f":"VLOOKUP(B58,LINGUA!$B:$H,2,0)","v":"humiSteam Basic 3 kg/h, 208V 1~, ON/OFF or proportional, disposable cylinder"},{"v":1030,"d":"€ 1,030.00"},null,{"$f":"IF(SELECTION!$C$46=\"Eur\",CODICI!D58,CODICI!D58*SELECTION!$C$48)","v":{"v":1030,"d":"€ 1,030.00"}}]
[54,"UE003YUC01",{"$f":"VLOOKUP(B59,LINGUA!$B:$H,2,0)","v":"humiSteam Basic 3 kg/h, 208V 1~, ON/OFF or proportional, cleanable cylinder"},{"v":1067,"d":"€ 1,067.00"},null,{"$f":"IF(SELECTION!$C$46=\"Eur\",CODICI!D59,CODICI!D59*SELECTION!$C$48)","v":{"v":1067,"d":"€ 1,067.00"}}]
[55,"UE003YW001",{"$f":"VLOOKUP(B60,LINGUA!$B:$H,2,0)","v":"humiSteam Basic 3 kg/h, 208V 3~, ON/OFF or proportional, disposable cylinder"},{"v":1030,"d":"€ 1,030.00"},null,{"$f":"IF(SELECTION!$C$46=\"Eur\",CODICI!D60,CODICI!D60*SELECTION!$C$48)","v":{"v":1030,"d":"€ 1,030.00"}}]
[56,"UE003YWC01",{"$f":"VLOOKUP(B61,LINGUA!$B:$H,2,0)","v":"humiSteam Basic 3 kg/h, 208V 3~, ON/OFF or proportional, cleanable cylinder"},{"v":1060,"d":"€ 1,060.00"},null,{"$f":"IF(SELECTION!$C$46=\"Eur\",CODICI!D61,CODICI!D61*SELECTION!$C$48)","v":{"v":1060,"d":"€ 1,060.00"}}]
[57,"UE005YD001",{"$f":"VLOOKUP(B62,LINGUA!$B:$H,2,0)","v":"humiSteam Basic 5 kg/h, 230V 1~, ON/OFF or proportional, disposable cylinder"},{"v":1137,"d":"€ 1,137.00"},null,{"$f":"IF(SELECTION!$C$46=\"Eur\",CODICI!D62,CODICI!D62*SELECTION!$C$48)","v":{"v":1137,"d":"€ 1,137.00"}}]
[58,"UE005YDC01",{"$f":"VLOOKUP(B63,LINGUA!$B:$H,2,0)","v":"humiSteam Basic 5 kg/h, 230V 1~, ON/OFF or proportional, cleanable cylinder"},{"v":1202,"d":"€ 1,202.00"},null,{"$f":"IF(SELECTION!$C$46=\"Eur\",CODICI!D63,CODICI!D63*SELECTION!$C$48)","v":{"v":1202,"d":"€ 1,202.00"}}]
[59,"UE005YK001",{"$f":"VLOOKUP(B64,LINGUA!$B:$H,2,0)","v":"humiSteam Basic 5 kg/h, 230V 3~, ON/OFF or proportional, disposable cylinder"},{"v":1138,"d":"€ 1,138.00"},null,{"$f":"IF(SELECTION!$C$46=\"Eur\",CODICI!D64,CODICI!D64*SELECTION!$C$48)","v":{"v":1138,"d":"€ 1,138.00"}}]
[60,"UE005YKC01",{"$f":"VLOOKUP(B65,LINGUA!$B:$H,2,0)","v":"humiSteam Basic 5 kg/h, 230V 3~, ON/OFF or proportional, cleanable cylinder"},{"v":1169,"d":"€ 1,169.00"},null,{"$f":"IF(SELECTION!$C$46=\"Eur\",CODICI!D65,CODICI!D65*SELECTION!$C$48)","v":{"v":1169,"d":"€ 1,169.00"}}]
[61,"UE005YL001",{"$f":"VLOOKUP(B66,LINGUA!$B:$H,2,0)","v":"humiSteam Basic 5 kg/h, 400V 3~, ON/OFF or proportional, disposable cylinder"},{"v":1137,"d":"€ 1,137.00"},null,{"$f":"IF(SELECTION!$C$46=\"Eur\",CODICI!D66,CODICI!D66*SELECTION!$C$48)","v":{"v":1137,"d":"€ 1,137.00"}}]
[62,"UE005YLC01",{"$f":"VLOOKUP(B67,LINGUA!$B:$H,2,0)","v":"humiSteam Basic 5 kg/h, 400V 3~, ON/OFF or proportional, cleanable cylinder"},{"v":1168,"d":"€ 1,168.00"},null,{"$f":"IF(SELECTION!$C$46=\"Eur\",CODICI!D67,CODICI!D67*SELECTION!$C$48)","v":{"v":1168,"d":"€ 1,168.00"}}]
[63,"UE005YM001",{"$f":"VLOOKUP(B68,LINGUA!$B:$H,2,0)","v":"humiSteam Basic 5 kg/h, 460V 3~, ON/OFF or proportional, disposable cylinder"},{"v":1138,"d":"€ 1,138.00"},null,{"$f":"IF(SELECTION!$C$46=\"Eur\",CODICI!D68,CODICI!D68*SELECTION!$C$48)","v":{"v":1138,"d":"€ 1,138.00"}}]
[64,"UE005YMC01",{"$f":"VLOOKUP(B69,LINGUA!$B:$H,2,0)","v":"humiSteam Basic 5 kg/h, 460V 3~, ON/OFF or proportional, cleanable cylinder"},{"v":1168,"d":"€ 1,168.00"},null,{"$f":"IF(SELECTION!$C$46=\"Eur\",CODICI!D69,CODICI!D69*SELECTION!$C$48)","v":{"v":1168,"d":"€ 1,168.00"}}]
[65,"UE005YN001",{"$f":"VLOOKUP(B70,LINGUA!$B:$H,2,0)","v":"humiSteam Basic 5 kg/h, 575V 3~, ON/OFF or proportional, disposable cylinder"},{"v":1138,"d":"€ 1,138.00"},null,{"$f":"IF(SELECTION!$C$46=\"Eur\",CODICI!D70,CODICI!D70*SELECTION!$C$48)","v":{"v":1138,"d":"€ 1,138.00"}}]
[66,"UE005YNC01",{"$f":"VLOOKUP(B71,LINGUA!$B:$H,2,0)","v":"humiSteam Basic 5 kg/h, 575V 3~, ON/OFF or proportional, cleanable cylinder"},{"v":1168,"d":"€ 1,168.00"},null,{"$f":"IF(SELECTION!$C$46=\"Eur\",CODICI!D71,CODICI!D71*SELECTION!$C$48)","v":{"v":1168,"d":"€ 1,168.00"}}]
[{"$f":"+A71+1","v":67},"UE005YU001",{"$f":"VLOOKUP(B72,LINGUA!$B:$H,2,0)","v":"humiSteam Basic 5 kg/h, 208V 1~, ON/OFF or proportional, disposable cylinder"},{"v":1138,"d":"€ 1,138.00"},null,{"$f":"IF(SELECTION!$C$46=\"Eur\",CODICI!D72,CODICI!D72*SELECTION!$C$48)","v":{"v":1138,"d":"€ 1,138.00"}}]
[68,"UE005YUC01",{"$f":"VLOOKUP(B73,LINGUA!$B:$H,2,0)","v":"humiSteam Basic 5 kg/h, 208V 1~, ON/OFF or proportional, cleanable cylinder"},{"v":1202,"d":"€ 1,202.00"},null,{"$f":"IF(SELECTION!$C$46=\"Eur\",CODICI!D73,CODICI!D73*SELECTION!$C$48)","v":{"v":1202,"d":"€ 1,202.00"}}]
[69,"UE005YW001",{"$f":"VLOOKUP(B74,LINGUA!$B:$H,2,0)","v":"humiSteam Basic 5 kg/h, 208V 3~, ON/OFF or proportional, disposable cylinder"},{"v":1138,"d":"€ 1,138.00"},null,{"$f":"IF(SELECTION!$C$46=\"Eur\",CODICI!D74,CODICI!D74*SELECTION!$C$48)","v":{"v":1138,"d":"€ 1,138.00"}}]
[70,"UE005YWC01",{"$f":"VLOOKUP(B75,LINGUA!$B:$H,2,0)","v":"humiSteam Basic 5 kg/h, 208V 3~, ON/OFF or proportional, cleanable cylinder"},{"v":1168,"d":"€ 1,168.00"},null,{"$f":"IF(SELECTION!$C$46=\"Eur\",CODICI!D75,CODICI!D75*SELECTION!$C$48)","v":{"v":1168,"d":"€ 1,168.00"}}]
[71,"UE008YK001",{"$f":"VLOOKUP(B76,LINGUA!$B:$H,2,0)","v":"humiSteam Basic 8 kg/h, 230V 3~, ON/OFF or proportional, disposable cylinder"},{"v":1217,"d":"€ 1,217.00"},null,{"$f":"IF(SELECTION!$C$46=\"Eur\",CODICI!D76,CODICI!D76*SELECTION!$C$48)","v":{"v":1217,"d":"€ 1,217.00"}}]
[72,"UE008YKC01",{"$f":"VLOOKUP(B77,LINGUA!$B:$H,2,0)","v":"humiSteam Basic 8 kg/h, 230V 3~, ON/OFF or proportional, cleanable cylinder"},{"v":1270,"d":"€ 1,270.00"},null,{"$f":"IF(SELECTION!$C$46=\"Eur\",CODICI!D77,CODICI!D77*SELECTION!$C$48)","v":{"v":1270,"d":"€ 1,270.00"}}]
[73,"UE008YL001",{"$f":"VLOOKUP(B78,LINGUA!$B:$H,2,0)","v":"humiSteam Basic 8 kg/h, 400V 3~, ON/OFF or proportional, disposable cylinder"},{"v":1216,"d":"€ 1,216.00"},null,{"$f":"IF(SELECTION!$C$46=\"Eur\",CODICI!D78,CODICI!D78*SELECTION!$C$48)","v":{"v":1216,"d":"€ 1,216.00"}}]
[74,"UE008YLC01",{"$f":"VLOOKUP(B79,LINGUA!$B:$H,2,0)","v":"humiSteam Basic 8 kg/h, 400V 3~, ON/OFF or proportional, cleanable cylinder"},{"v":1270,"d":"€ 1,270.00"},null,{"$f":"IF(SELECTION!$C$46=\"Eur\",CODICI!D79,CODICI!D79*SELECTION!$C$48)","v":{"v":1270,"d":"€ 1,270.00"}}]
[75,"UE008YM001",{"$f":"VLOOKUP(B80,LINGUA!$B:$H,2,0)","v":"humiSteam Basic 8 kg/h, 460V 3~, ON/OFF or proportional, disposable cylinder"},{"v":1217,"d":"€ 1,217.00"},null,{"$f":"IF(SELECTION!$C$46=\"Eur\",CODICI!D80,CODICI!D80*SELECTION!$C$48)","v":{"v":1217,"d":"€ 1,217.00"}}]
[76,"UE008YMC01",{"$f":"VLOOKUP(B81,LINGUA!$B:$H,2,0)","v":"humiSteam Basic 8 kg/h, 460V 3~, ON/OFF or proportional, cleanable cylinder"},{"v":1270,"d":"€ 1,270.00"},null,{"$f":"IF(SELECTION!$C$46=\"Eur\",CODICI!D81,CODICI!D81*SELECTION!$C$48)","v":{"v":1270,"d":"€ 1,270.00"}}]
[77,"UE008YN001",{"$f":"VLOOKUP(B82,LINGUA!$B:$H,2,0)","v":"humiSteam Basic 8 kg/h, 575V 3~, ON/OFF or proportional, disposable cylinder"},{"v":1217,"d":"€ 1,217.00"},null,{"$f":"IF(SELECTION!$C$46=\"Eur\",CODICI!D82,CODICI!D82*SELECTION!$C$48)","v":{"v":1217,"d":"€ 1,217.00"}}]
[78,"UE008YNC01",{"$f":"VLOOKUP(B83,LINGUA!$B:$H,2,0)","v":"humiSteam Basic 8 kg/h, 575V 3~, ON/OFF or proportional, cleanable cylinder"},{"v":1270,"d":"€ 1,270.00"},null,{"$f":"IF(SELECTION!$C$46=\"Eur\",CODICI!D83,CODICI!D83*SELECTION!$C$48)","v":{"v":1270,"d":"€ 1,270.00"}}]
[79,"UE008YW001",{"$f":"VLOOKUP(B84,LINGUA!$B:$H,2,0)","v":"humiSteam Basic 8 kg/h, 208V 3~, ON/OFF or proportional, disposable cylinder"},{"v":1217,"d":"€ 1,217.00"},null,{"$f":"IF(SELECTION!$C$46=\"Eur\",CODICI!D84,CODICI!D84*SELECTION!$C$48)","v":{"v":1217,"d":"€ 1,217.00"}}]
[80,"UE008YWC01",{"$f":"VLOOKUP(B85,LINGUA!$B:$H,2,0)","v":"humiSteam Basic 8 kg/h, 208V 3~, ON/OFF or proportional, cleanable cylinder"},{"v":1270,"d":"€ 1,270.00"},null,{"$f":"IF(SELECTION!$C$46=\"Eur\",CODICI!D85,CODICI!D85*SELECTION!$C$48)","v":{"v":1270,"d":"€ 1,270.00"}}]
[81,"UE009YD001",{"$f":"VLOOKUP(B86,LINGUA!$B:$H,2,0)","v":"humiSteam Basic 9 kg/h, 230V 1~, ON/OFF or proportional, disposable cylinder"},{"v":1276,"d":"€ 1,276.00"},null,{"$f":"IF(SELECTION!$C$46=\"Eur\",CODICI!D86,CODICI!D86*SELECTION!$C$48)","v":{"v":1276,"d":"€ 1,276.00"}}]
[82,"UE009YDC01",{"$f":"VLOOKUP(B87,LINGUA!$B:$H,2,0)","v":"humiSteam Basic 9 kg/h, 230V 1~, ON/OFF or proportional, cleanable cylinder"},{"v":1341,"d":"€ 1,341.00"},null,{"$f":"IF(SELECTION!$C$46=\"Eur\",CODICI!D87,CODICI!D87*SELECTION!$C$48)","v":{"v":1341,"d":"€ 1,341.00"}}]
[83,"UE009YU001",{"$f":"VLOOKUP(B88,LINGUA!$B:$H,2,0)","v":"humiSteam Basic 9 kg/h, 208V 1~, ON/OFF or proportional, disposable cylinder"},{"v":1276,"d":"€ 1,276.00"},null,{"$f":"IF(SELECTION!$C$46=\"Eur\",CODICI!D88,CODICI!D88*SELECTION!$C$48)","v":{"v":1276,"d":"€ 1,276.00"}}]
[84,"UE009YUC01",{"$f":"VLOOKUP(B89,LINGUA!$B:$H,2,0)","v":"humiSteam Basic 9 kg/h, 208V 1~, ON/OFF or proportional, cleanable cylinder"},{"v":1341,"d":"€ 1,341.00"},null,{"$f":"IF(SELECTION!$C$46=\"Eur\",CODICI!D89,CODICI!D89*SELECTION!$C$48)","v":{"v":1341,"d":"€ 1,341.00"}}]
[85,"UE010YK001",{"$f":"VLOOKUP(B90,LINGUA!$B:$H,2,0)","v":"humiSteam Basic 10 kg/h, 230V 3~, ON/OFF or proportional, disposable cylinder"},{"v":1251,"d":"€ 1,251.00"},null,{"$f":"IF(SELECTION!$C$46=\"Eur\",CODICI!D90,CODICI!D90*SELECTION!$C$48)","v":{"v":1251,"d":"€ 1,251.00"}}]
[86,"UE010YKC01",{"$f":"VLOOKUP(B91,LINGUA!$B:$H,2,0)","v":"humiSteam Basic 10 kg/h, 230V 3~, ON/OFF or proportional, cleanable cylinder"},{"v":1336,"d":"€ 1,336.00"},null,{"$f":"IF(SELECTION!$C$46=\"Eur\",CODICI!D91,CODICI!D91*SELECTION!$C$48)","v":{"v":1336,"d":"€ 1,336.00"}}]
[87,"UE010YL001",{"$f":"VLOOKUP(B92,LINGUA!$B:$H,2,0)","v":"humiSteam Basic 10 kg/h, 400V 3~, ON/OFF or proportional, disposable cylinder"},{"v":1250,"d":"€ 1,250.00"},null,{"$f":"IF(SELECTION!$C$46=\"Eur\",CODICI!D92,CODICI!D92*SELECTION!$C$48)","v":{"v":1250,"d":"€ 1,250.00"}}]
[88,"UE010YLC01",{"$f":"VLOOKUP(B93,LINGUA!$B:$H,2,0)","v":"humiSteam Basic 10 kg/h, 400V 3~, ON/OFF or proportional, cleanable cylinder"},{"v":1336,"d":"€ 1,336.00"},null,{"$f":"IF(SELECTION!$C$46=\"Eur\",CODICI!D93,CODICI!D93*SELECTION!$C$48)","v":{"v":1336,"d":"€ 1,336.00"}}]
[89,"UE010YM001",{"$f":"VLOOKUP(B94,LINGUA!$B:$H,2,0)","v":"humiSteam Basic 10 kg/h, 460V 3~, ON/OFF or proportional, disposable cylinder"},{"v":1251,"d":"€ 1,251.00"},null,{"$f":"IF(SELECTION!$C$46=\"Eur\",CODICI!D94,CODICI!D94*SELECTION!$C$48)","v":{"v":1251,"d":"€ 1,251.00"}}]
[90,"UE010YMC01",{"$f":"VLOOKUP(B95,LINGUA!$B:$H,2,0)","v":"humiSteam Basic 10 kg/h, 460V 3~, ON/OFF or proportional, cleanable cylinder"},{"v":1336,"d":"€ 1,336.00"},null,{"$f":"IF(SELECTION!$C$46=\"Eur\",CODICI!D95,CODICI!D95*SELECTION!$C$48)","v":{"v":1336,"d":"€ 1,336.00"}}]
[91,"UE010YN001",{"$f":"VLOOKUP(B96,LINGUA!$B:$H,2,0)","v":"humiSteam Basic 10 kg/h, 575V 3~, ON/OFF or proportional, disposable cylinder"},{"v":1251,"d":"€ 1,251.00"},null,{"$f":"IF(SELECTION!$C$46=\"Eur\",CODICI!D96,CODICI!D96*SELECTION!$C$48)","v":{"v":1251,"d":"€ 1,251.00"}}]
[92,"UE010YNC01",{"$f":"VLOOKUP(B97,LINGUA!$B:$H,2,0)","v":"humiSteam Basic 10 kg/h, 575V 3~, ON/OFF or proportional, cleanable cylinder"},{"v":1336,"d":"€ 1,336.00"},null,{"$f":"IF(SELECTION!$C$46=\"Eur\",CODICI!D97,CODICI!D97*SELECTION!$C$48)","v":{"v":1336,"d":"€ 1,336.00"}}]
[93,"UE010YW001",{"$f":"VLOOKUP(B98,LINGUA!$B:$H,2,0)","v":"humiSteam Basic 10 kg/h, 208V 3~, ON/OFF or proportional, disposable cylinder"},{"v":1251,"d":"€ 1,251.00"},null,{"$f":"IF(SELECTION!$C$46=\"Eur\",CODICI!D98,CODICI!D98*SELECTION!$C$48)","v":{"v":1251,"d":"€ 1,251.00"}}]
[94,"UE010YWC01",{"$f":"VLOOKUP(B99,LINGUA!$B:$H,2,0)","v":"humiSteam Basic 10 kg/h, 208V 3~, ON/OFF or proportional, cleanable cylinder"},{"v":1336,"d":"€ 1,336.00"},null,{"$f":"IF(SELECTION!$C$46=\"Eur\",CODICI!D99,CODICI!D99*SELECTION!$C$48)","v":{"v":1336,"d":"€ 1,336.00"}}]
[95,"UE015YK001",{"$f":"VLOOKUP(B100,LINGUA!$B:$H,2,0)","v":"humiSteam Basic 15 kg/h, 230V 3~, ON/OFF or proportional, disposable cylinder"},{"v":1293,"d":"€ 1,293.00"},null,{"$f":"IF(SELECTION!$C$46=\"Eur\",CODICI!D100,CODICI!D100*SELECTION!$C$48)","v":{"v":1293,"d":"€ 1,293.00"}}]
[96,"UE015YKC01",{"$f":"VLOOKUP(B101,LINGUA!$B:$H,2,0)","v":"humiSteam Basic 15 kg/h, 230V 3~, ON/OFF or proportional, cleanable cylinder"},{"v":1377,"d":"€ 1,377.00"},null,{"$f":"IF(SELECTION!$C$46=\"Eur\",CODICI!D101,CODICI!D101*SELECTION!$C$48)","v":{"v":1377,"d":"€ 1,377.00"}}]
[97,"UE015YL001",{"$f":"VLOOKUP(B102,LINGUA!$B:$H,2,0)","v":"humiSteam Basic 15 kg/h, 400V 3~, ON/OFF or proportional, disposable cylinder"},{"v":1293,"d":"€ 1,293.00"},null,{"$f":"IF(SELECTION!$C$46=\"Eur\",CODICI!D102,CODICI!D102*SELECTION!$C$48)","v":{"v":1293,"d":"€ 1,293.00"}}]
[98,"UE015YLC01",{"$f":"VLOOKUP(B103,LINGUA!$B:$H,2,0)","v":"humiSteam Basic 15 kg/h, 400V 3~, ON/OFF or proportional, cleanable cylinder"},{"v":1377,"d":"€ 1,377.00"},null,{"$f":"IF(SELECTION!$C$46=\"Eur\",CODICI!D103,CODICI!D103*SELECTION!$C$48)","v":{"v":1377,"d":"€ 1,377.00"}}]
[99,"UE015YM001",{"$f":"VLOOKUP(B104,LINGUA!$B:$H,2,0)","v":"humiSteam Basic 15 kg/h, 460V 3~, ON/OFF or proportional, disposable cylinder"},{"v":1293,"d":"€ 1,293.00"},null,{"$f":"IF(SELECTION!$C$46=\"Eur\",CODICI!D104,CODICI!D104*SELECTION!$C$48)","v":{"v":1293,"d":"€ 1,293.00"}}]
[100,"UE015YMC01",{"$f":"VLOOKUP(B105,LINGUA!$B:$H,2,0)","v":"humiSteam Basic 15 kg/h, 460V 3~, ON/OFF or proportional, cleanable cylinder"},{"v":1377,"d":"€ 1,377.00"},null,{"$f":"IF(SELECTION!$C$46=\"Eur\",CODICI!D105,CODICI!D105*SELECTION!$C$48)","v":{"v":1377,"d":"€ 1,377.00"}}]
[101,"UE015YN001",{"$f":"VLOOKUP(B106,LINGUA!$B:$H,2,0)","v":"humiSteam Basic 15 kg/h, 575V 3~, ON/OFF or proportional, disposable cylinder"},{"v":1293,"d":"€ 1,293.00"},null,{"$f":"IF(SELECTION!$C$46=\"Eur\",CODICI!D106,CODICI!D106*SELECTION!$C$48)","v":{"v":1293,"d":"€ 1,293.00"}}]
[102,"UE015YNC01",{"$f":"VLOOKUP(B107,LINGUA!$B:$H,2,0)","v":"humiSteam Basic 15 kg/h, 575V 3~, ON/OFF or proportional, cleanable cylinder"},{"v":1377,"d":"€ 1,377.00"},null,{"$f":"IF(SELECTION!$C$46=\"Eur\",CODICI!D107,CODICI!D107*SELECTION!$C$48)","v":{"v":1377,"d":"€ 1,377.00"}}]
[103,"UE015YW001",{"$f":"VLOOKUP(B108,LINGUA!$B:$H,2,0)","v":"humiSteam Basic 15 kg/h, 208V 3~, ON/OFF or proportional, disposable cylinder"},{"v":1293,"d":"€ 1,293.00"},null,{"$f":"IF(SELECTION!$C$46=\"Eur\",CODICI!D108,CODICI!D108*SELECTION!$C$48)","v":{"v":1293,"d":"€ 1,293.00"}}]
[104,"UE015YWC01",{"$f":"VLOOKUP(B109,LINGUA!$B:$H,2,0)","v":"humiSteam Basic 15 kg/h, 208V 3~, ON/OFF or proportional, cleanable cylinder"},{"v":1377,"d":"€ 1,377.00"},null,{"$f":"IF(SELECTION!$C$46=\"Eur\",CODICI!D109,CODICI!D109*SELECTION!$C$48)","v":{"v":1377,"d":"€ 1,377.00"}}]
[105,"UE018YL001",{"$f":"VLOOKUP(B110,LINGUA!$B:$H,2,0)","v":"humiSteam Basic 18 kg/h, 400V 3~, ON/OFF or proportional, disposable cylinder"},{"v":1330,"d":"€ 1,330.00"},null,{"$f":"IF(SELECTION!$C$46=\"Eur\",CODICI!D110,CODICI!D110*SELECTION!$C$48)","v":{"v":1330,"d":"€ 1,330.00"}}]
[106,"UE018YLC01",{"$f":"VLOOKUP(B111,LINGUA!$B:$H,2,0)","v":"humiSteam Basic 18 kg/h, 400V 3~, ON/OFF or proportional, cleanable cylinder"},{"v":1395,"d":"€ 1,395.00"},null,{"$f":"IF(SELECTION!$C$46=\"Eur\",CODICI!D111,CODICI!D111*SELECTION!$C$48)","v":{"v":1395,"d":"€ 1,395.00"}}]
[107,"UE018YM001",{"$f":"VLOOKUP(B112,LINGUA!$B:$H,2,0)","v":"humiSteam Basic 18 kg/h, 460V 3~, ON/OFF or proportional, disposable cylinder"},{"v":1330,"d":"€ 1,330.00"},null,{"$f":"IF(SELECTION!$C$46=\"Eur\",CODICI!D112,CODICI!D112*SELECTION!$C$48)","v":{"v":1330,"d":"€ 1,330.00"}}]
[108,"UE018YMC01",{"$f":"VLOOKUP(B113,LINGUA!$B:$H,2,0)","v":"humiSteam Basic 18 kg/h, 460V 3~, ON/OFF or proportional, cleanable cylinder"},{"v":1395,"d":"€ 1,395.00"},null,{"$f":"IF(SELECTION!$C$46=\"Eur\",CODICI!D113,CODICI!D113*SELECTION!$C$48)","v":{"v":1395,"d":"€ 1,395.00"}}]
[109,"UE018YN001",{"$f":"VLOOKUP(B114,LINGUA!$B:$H,2,0)","v":"humiSteam Basic 18 kg/h, 575V 3~, ON/OFF or proportional, disposable cylinder"},{"v":1330,"d":"€ 1,330.00"},null,{"$f":"IF(SELECTION!$C$46=\"Eur\",CODICI!D114,CODICI!D114*SELECTION!$C$48)","v":{"v":1330,"d":"€ 1,330.00"}}]
[110,"UE018YNC01",{"$f":"VLOOKUP(B115,LINGUA!$B:$H,2,0)","v":"humiSteam Basic 18 kg/h, 575V 3~, ON/OFF or proportional, cleanable cylinder"},{"v":1395,"d":"€ 1,395.00"},null,{"$f":"IF(SELECTION!$C$46=\"Eur\",CODICI!D115,CODICI!D115*SELECTION!$C$48)","v":{"v":1395,"d":"€ 1,395.00"}}]
[111,"UE025YK001",{"$f":"VLOOKUP(B116,LINGUA!$B:$H,2,0)","v":"humiSteam Basic 25 kg/h, 230V 3~, ON/OFF or proportional, disposable cylinder"},{"v":1727,"d":"€ 1,727.00"},null,{"$f":"IF(SELECTION!$C$46=\"Eur\",CODICI!D116,CODICI!D116*SELECTION!$C$48)","v":{"v":1727,"d":"€ 1,727.00"}}]
[112,"UE025YKC01",{"$f":"VLOOKUP(B117,LINGUA!$B:$H,2,0)","v":"humiSteam Basic 25 kg/h, 230V 3~, ON/OFF or proportional, cleanable cylinder"},{"v":1804,"d":"€ 1,804.00"},null,{"$f":"IF(SELECTION!$C$46=\"Eur\",CODICI!D117,CODICI!D117*SELECTION!$C$48)","v":{"v":1804,"d":"€ 1,804.00"}}]
[113,"UE025YL001",{"$f":"VLOOKUP(B118,LINGUA!$B:$H,2,0)","v":"humiSteam Basic 25 kg/h, 400V 3~, ON/OFF or proportional, disposable cylinder"},{"v":1727,"d":"€ 1,727.00"},null,{"$f":"IF(SELECTION!$C$46=\"Eur\",CODICI!D118,CODICI!D118*SELECTION!$C$48)","v":{"v":1727,"d":"€ 1,727.00"}}]
[114,"UE025YLC01",{"$f":"VLOOKUP(B119,LINGUA!$B:$H,2,0)","v":"humiSteam Basic 25 kg/h, 400V 3~, ON/OFF or proportional, cleanable cylinder"},{"v":1804,"d":"€ 1,804.00"},null,{"$f":"IF(SELECTION!$C$46=\"Eur\",CODICI!D119,CODICI!D119*SELECTION!$C$48)","v":{"v":1804,"d":"€ 1,804.00"}}]
[115,"UE025YM001",{"$f":"VLOOKUP(B120,LINGUA!$B:$H,2,0)","v":"humiSteam Basic 25 kg/h, 460V 3~, ON/OFF or proportional, disposable cylinder"},{"v":1727,"d":"€ 1,727.00"},null,{"$f":"IF(SELECTION!$C$46=\"Eur\",CODICI!D120,CODICI!D120*SELECTION!$C$48)","v":{"v":1727,"d":"€ 1,727.00"}}]
[116,"UE025YMC01",{"$f":"VLOOKUP(B121,LINGUA!$B:$H,2,0)","v":"humiSteam Basic 25 kg/h, 460V 3~, ON/OFF or proportional, cleanable cylinder"},{"v":1804,"d":"€ 1,804.00"},null,{"$f":"IF(SELECTION!$C$46=\"Eur\",CODICI!D121,CODICI!D121*SELECTION!$C$48)","v":{"v":1804,"d":"€ 1,804.00"}}]
[117,"UE025YN001",{"$f":"VLOOKUP(B122,LINGUA!$B:$H,2,0)","v":"humiSteam Basic 25 kg/h, 575V 3~, ON/OFF or proportional, disposable cylinder"},{"v":1727,"d":"€ 1,727.00"},null,{"$f":"IF(SELECTION!$C$46=\"Eur\",CODICI!D122,CODICI!D122*SELECTION!$C$48)","v":{"v":1727,"d":"€ 1,727.00"}}]
[118,"UE025YNC01",{"$f":"VLOOKUP(B123,LINGUA!$B:$H,2,0)","v":"humiSteam Basic 25 kg/h, 575V 3~, ON/OFF or proportional, cleanable cylinder"},{"v":1804,"d":"€ 1,804.00"},null,{"$f":"IF(SELECTION!$C$46=\"Eur\",CODICI!D123,CODICI!D123*SELECTION!$C$48)","v":{"v":1804,"d":"€ 1,804.00"}}]
[119,"UE025YW001",{"$f":"VLOOKUP(B124,LINGUA!$B:$H,2,0)","v":"humiSteam Basic 25 kg/h, 208V 3~, ON/OFF or proportional, disposable cylinder"},{"v":1727,"d":"€ 1,727.00"},null,{"$f":"IF(SELECTION!$C$46=\"Eur\",CODICI!D124,CODICI!D124*SELECTION!$C$48)","v":{"v":1727,"d":"€ 1,727.00"}}]
[120,"UE025YWC01",{"$f":"VLOOKUP(B125,LINGUA!$B:$H,2,0)","v":"humiSteam Basic 25 kg/h, 208V 3~, ON/OFF or proportional, cleanable cylinder"},{"v":1804,"d":"€ 1,804.00"},null,{"$f":"IF(SELECTION!$C$46=\"Eur\",CODICI!D125,CODICI!D125*SELECTION!$C$48)","v":{"v":1804,"d":"€ 1,804.00"}}]
[121,"UE035YK001",{"$f":"VLOOKUP(B126,LINGUA!$B:$H,2,0)","v":"humiSteam Basic 35 kg/h, 230V 3~, ON/OFF or proportional, disposable cylinder"},{"v":1979,"d":"€ 1,979.00"},null,{"$f":"IF(SELECTION!$C$46=\"Eur\",CODICI!D126,CODICI!D126*SELECTION!$C$48)","v":{"v":1979,"d":"€ 1,979.00"}}]
[122,"UE035YKC01",{"$f":"VLOOKUP(B127,LINGUA!$B:$H,2,0)","v":"humiSteam Basic 35 kg/h, 230V 3~, ON/OFF or proportional, cleanable cylinder"},{"v":2047,"d":"€ 2,047.00"},null,{"$f":"IF(SELECTION!$C$46=\"Eur\",CODICI!D127,CODICI!D127*SELECTION!$C$48)","v":{"v":2047,"d":"€ 2,047.00"}}]
[123,"UE035YL001",{"$f":"VLOOKUP(B128,LINGUA!$B:$H,2,0)","v":"humiSteam Basic 35 kg/h, 400V 3~, ON/OFF or proportional, disposable cylinder"},{"v":1979,"d":"€ 1,979.00"},null,{"$f":"IF(SELECTION!$C$46=\"Eur\",CODICI!D128,CODICI!D128*SELECTION!$C$48)","v":{"v":1979,"d":"€ 1,979.00"}}]
[124,"UE035YLC01",{"$f":"VLOOKUP(B129,LINGUA!$B:$H,2,0)","v":"humiSteam Basic 35 kg/h, 400V 3~, ON/OFF or proportional, cleanable cylinder"},{"v":2047,"d":"€ 2,047.00"},null,{"$f":"IF(SELECTION!$C$46=\"Eur\",CODICI!D129,CODICI!D129*SELECTION!$C$48)","v":{"v":2047,"d":"€ 2,047.00"}}]
[125,"UE035YM001",{"$f":"VLOOKUP(B130,LINGUA!$B:$H,2,0)","v":"humiSteam Basic 35 kg/h, 460V 3~, ON/OFF or proportional, disposable cylinder"},{"v":1979,"d":"€ 1,979.00"},null,{"$f":"IF(SELECTION!$C$46=\"Eur\",CODICI!D130,CODICI!D130*SELECTION!$C$48)","v":{"v":1979,"d":"€ 1,979.00"}}]
[126,"UE035YMC01",{"$f":"VLOOKUP(B131,LINGUA!$B:$H,2,0)","v":"humiSteam Basic 35 kg/h, 460V 3~, ON/OFF or proportional, cleanable cylinder"},{"v":2047,"d":"€ 2,047.00"},null,{"$f":"IF(SELECTION!$C$46=\"Eur\",CODICI!D131,CODICI!D131*SELECTION!$C$48)","v":{"v":2047,"d":"€ 2,047.00"}}]
[127,"UE035YN001",{"$f":"VLOOKUP(B132,LINGUA!$B:$H,2,0)","v":"humiSteam Basic 35 kg/h, 575V 3~, ON/OFF or proportional, disposable cylinder"},{"v":1979,"d":"€ 1,979.00"},null,{"$f":"IF(SELECTION!$C$46=\"Eur\",CODICI!D132,CODICI!D132*SELECTION!$C$48)","v":{"v":1979,"d":"€ 1,979.00"}}]
[128,"UE035YNC01",{"$f":"VLOOKUP(B133,LINGUA!$B:$H,2,0)","v":"humiSteam Basic 35 kg/h, 575V 3~, ON/OFF or proportional, cleanable cylinder"},{"v":2047,"d":"€ 2,047.00"},null,{"$f":"IF(SELECTION!$C$46=\"Eur\",CODICI!D133,CODICI!D133*SELECTION!$C$48)","v":{"v":2047,"d":"€ 2,047.00"}}]
[129,"UE035YW001",{"$f":"VLOOKUP(B134,LINGUA!$B:$H,2,0)","v":"humiSteam Basic 35 kg/h, 208V 3~, ON/OFF or proportional, disposable cylinder"},{"v":1979,"d":"€ 1,979.00"},null,{"$f":"IF(SELECTION!$C$46=\"Eur\",CODICI!D134,CODICI!D134*SELECTION!$C$48)","v":{"v":1979,"d":"€ 1,979.00"}}]
[130,"UE035YWC01",{"$f":"VLOOKUP(B135,LINGUA!$B:$H,2,0)","v":"humiSteam Basic 35 kg/h, 208V 3~, ON/OFF or proportional, cleanable cylinder"},{"v":2047,"d":"€ 2,047.00"},null,{"$f":"IF(SELECTION!$C$46=\"Eur\",CODICI!D135,CODICI!D135*SELECTION!$C$48)","v":{"v":2047,"d":"€ 2,047.00"}}]
[{"$f":"+A135+1","v":131},"UE045YK001",{"$f":"VLOOKUP(B136,LINGUA!$B:$H,2,0)","v":"humiSteam Basic 45 kg/h, 230V 3~, ON/OFF or proportional, disposable cylinder"},{"v":2163,"d":"€ 2,163.00"},null,{"$f":"IF(SELECTION!$C$46=\"Eur\",CODICI!D136,CODICI!D136*SELECTION!$C$48)","v":{"v":2163,"d":"€ 2,163.00"}}]
[132,"UE045YKC01",{"$f":"VLOOKUP(B137,LINGUA!$B:$H,2,0)","v":"humiSteam Basic 45 kg/h, 230V 3~, ON/OFF or proportional, cleanable cylinder"},{"v":2232,"d":"€ 2,232.00"},null,{"$f":"IF(SELECTION!$C$46=\"Eur\",CODICI!D137,CODICI!D137*SELECTION!$C$48)","v":{"v":2232,"d":"€ 2,232.00"}}]
[133,"UE045YL001",{"$f":"VLOOKUP(B138,LINGUA!$B:$H,2,0)","v":"humiSteam Basic 45 kg/h, 400V 3~, ON/OFF or proportional, disposable cylinder"},{"v":2162,"d":"€ 2,162.00"},null,{"$f":"IF(SELECTION!$C$46=\"Eur\",CODICI!D138,CODICI!D138*SELECTION!$C$48)","v":{"v":2162,"d":"€ 2,162.00"}}]
[134,"UE045YLC01",{"$f":"VLOOKUP(B139,LINGUA!$B:$H,2,0)","v":"humiSteam Basic 45 kg/h, 400V 3~, ON/OFF or proportional, cleanable cylinder"},{"v":2231,"d":"€ 2,231.00"},null,{"$f":"IF(SELECTION!$C$46=\"Eur\",CODICI!D139,CODICI!D139*SELECTION!$C$48)","v":{"v":2231,"d":"€ 2,231.00"}}]
[135,"UE045YM001",{"$f":"VLOOKUP(B140,LINGUA!$B:$H,2,0)","v":"humiSteam Basic 45 kg/h, 460V 3~, ON/OFF or proportional, disposable cylinder"},{"v":2163,"d":"€ 2,163.00"},null,{"$f":"IF(SELECTION!$C$46=\"Eur\",CODICI!D140,CODICI!D140*SELECTION!$C$48)","v":{"v":2163,"d":"€ 2,163.00"}}]
[136,"UE045YMC01",{"$f":"VLOOKUP(B141,LINGUA!$B:$H,2,0)","v":"humiSteam Basic 45 kg/h, 460V 3~, ON/OFF or proportional, cleanable cylinder"},{"v":2232,"d":"€ 2,232.00"},null,{"$f":"IF(SELECTION!$C$46=\"Eur\",CODICI!D141,CODICI!D141*SELECTION!$C$48)","v":{"v":2232,"d":"€ 2,232.00"}}]
[137,"UE045YN001",{"$f":"VLOOKUP(B142,LINGUA!$B:$H,2,0)","v":"humiSteam Basic 45 kg/h, 575V 3~, ON/OFF or proportional, disposable cylinder"},{"v":2163,"d":"€ 2,163.00"},null,{"$f":"IF(SELECTION!$C$46=\"Eur\",CODICI!D142,CODICI!D142*SELECTION!$C$48)","v":{"v":2163,"d":"€ 2,163.00"}}]
[138,"UE045YNC01",{"$f":"VLOOKUP(B143,LINGUA!$B:$H,2,0)","v":"humiSteam Basic 45 kg/h, 575V 3~, ON/OFF or proportional, cleanable cylinder"},{"v":2232,"d":"€ 2,232.00"},null,{"$f":"IF(SELECTION!$C$46=\"Eur\",CODICI!D143,CODICI!D143*SELECTION!$C$48)","v":{"v":2232,"d":"€ 2,232.00"}}]
[139,"UE045YW001",{"$f":"VLOOKUP(B144,LINGUA!$B:$H,2,0)","v":"humiSteam Basic 45 kg/h, 208V 3~, ON/OFF or proportional, disposable cylinder"},{"v":2163,"d":"€ 2,163.00"},null,{"$f":"IF(SELECTION!$C$46=\"Eur\",CODICI!D144,CODICI!D144*SELECTION!$C$48)","v":{"v":2163,"d":"€ 2,163.00"}}]
[140,"UE045YWC01",{"$f":"VLOOKUP(B145,LINGUA!$B:$H,2,0)","v":"humiSteam Basic 45 kg/h, 208V 3~, ON/OFF or proportional, cleanable cylinder"},{"v":2232,"d":"€ 2,232.00"},null,{"$f":"IF(SELECTION!$C$46=\"Eur\",CODICI!D145,CODICI!D145*SELECTION!$C$48)","v":{"v":2232,"d":"€ 2,232.00"}}]
[141,"UE065YL001",{"$f":"VLOOKUP(B146,LINGUA!$B:$H,2,0)","v":"humiSteam Basic 65 kg/h, 400V 3~, ON/OFF or proportional, disposable cylinder"},{"v":2609,"d":"€ 2,609.00"},null,{"$f":"IF(SELECTION!$C$46=\"Eur\",CODICI!D146,CODICI!D146*SELECTION!$C$48)","v":{"v":2609,"d":"€ 2,609.00"}}]
[142,"UE065YLC01",{"$f":"VLOOKUP(B147,LINGUA!$B:$H,2,0)","v":"humiSteam Basic 65 kg/h, 400V 3~, ON/OFF or proportional, cleanable cylinder"},{"v":2754,"d":"€ 2,754.00"},null,{"$f":"IF(SELECTION!$C$46=\"Eur\",CODICI!D147,CODICI!D147*SELECTION!$C$48)","v":{"v":2754,"d":"€ 2,754.00"}}]
[143,"UE065YM001",{"$f":"VLOOKUP(B148,LINGUA!$B:$H,2,0)","v":"humiSteam Basic 65 kg/h, 460V 3~, ON/OFF or proportional, disposable cylinder"},{"v":2609,"d":"€ 2,609.00"},null,{"$f":"IF(SELECTION!$C$46=\"Eur\",CODICI!D148,CODICI!D148*SELECTION!$C$48)","v":{"v":2609,"d":"€ 2,609.00"}}]
[144,"UE065YMC01",{"$f":"VLOOKUP(B149,LINGUA!$B:$H,2,0)","v":"humiSteam Basic 65 kg/h, 460V 3~, ON/OFF or proportional, cleanable cylinder"},{"v":2754,"d":"€ 2,754.00"},null,{"$f":"IF(SELECTION!$C$46=\"Eur\",CODICI!D149,CODICI!D149*SELECTION!$C$48)","v":{"v":2754,"d":"€ 2,754.00"}}]
[145,"UE065YN001",{"$f":"VLOOKUP(B150,LINGUA!$B:$H,2,0)","v":"humiSteam Basic 65 kg/h, 575V 3~, ON/OFF or proportional, disposable cylinder"},{"v":2609,"d":"€ 2,609.00"},null,{"$f":"IF(SELECTION!$C$46=\"Eur\",CODICI!D150,CODICI!D150*SELECTION!$C$48)","v":{"v":2609,"d":"€ 2,609.00"}}]
[146,"UE065YNC01",{"$f":"VLOOKUP(B151,LINGUA!$B:$H,2,0)","v":"humiSteam Basic 65 kg/h, 575V 3~, ON/OFF or proportional, cleanable cylinder"},{"v":2754,"d":"€ 2,754.00"},null,{"$f":"IF(SELECTION!$C$46=\"Eur\",CODICI!D151,CODICI!D151*SELECTION!$C$48)","v":{"v":2754,"d":"€ 2,754.00"}}]
[147,"UE001XD001",{"$f":"VLOOKUP(B152,LINGUA!$B:$H,2,0)","v":"humiSteam X-plus 1,5 kg/h, 230Vac 1~, with regulation, disposable cylinder"},{"v":1063,"d":"€ 1,063.00"},null,{"$f":"IF(SELECTION!$C$46=\"Eur\",CODICI!D152,CODICI!D152*SELECTION!$C$48)","v":{"v":1063,"d":"€ 1,063.00"}}]
[148,"UE001XDC01",{"$f":"VLOOKUP(B153,LINGUA!$B:$H,2,0)","v":"humiSteam X-plus 1,5 kg/h, 230Vac 1~, with regulation, cleanable cylinder"},{"v":1101,"d":"€ 1,101.00"},null,{"$f":"IF(SELECTION!$C$46=\"Eur\",CODICI!D153,CODICI!D153*SELECTION!$C$48)","v":{"v":1101,"d":"€ 1,101.00"}}]
[149,"UE001XU001",{"$f":"VLOOKUP(B154,LINGUA!$B:$H,2,0)","v":"humiSteam X-plus 1,5 kg/h, 208Vac 1~, with regulation, disposable cylinder"},{"v":1063,"d":"€ 1,063.00"},null,{"$f":"IF(SELECTION!$C$46=\"Eur\",CODICI!D154,CODICI!D154*SELECTION!$C$48)","v":{"v":1063,"d":"€ 1,063.00"}}]
[150,"UE001XUC01",{"$f":"VLOOKUP(B155,LINGUA!$B:$H,2,0)","v":"humiSteam X-plus 1,5 kg/h, 208Vac 1~, with regulation, cleanable cylinder"},{"v":1101,"d":"€ 1,101.00"},null,{"$f":"IF(SELECTION!$C$46=\"Eur\",CODICI!D155,CODICI!D155*SELECTION!$C$48)","v":{"v":1101,"d":"€ 1,101.00"}}]
[151,"UE003XD001",{"$f":"VLOOKUP(B156,LINGUA!$B:$H,2,0)","v":"humiSteam X-plus 3 kg/h, 230Vac 1~, with regulation, disposable cylinder"},{"v":1210,"d":"€ 1,210.00"},null,{"$f":"IF(SELECTION!$C$46=\"Eur\",CODICI!D156,CODICI!D156*SELECTION!$C$48)","v":{"v":1210,"d":"€ 1,210.00"}}]
[152,"UE003XDC01",{"$f":"VLOOKUP(B157,LINGUA!$B:$H,2,0)","v":"humiSteam X-plus 3 kg/h, 230Vac 1~, with regulation, cleanable cylinder"},{"v":1248,"d":"€ 1,248.00"},null,{"$f":"IF(SELECTION!$C$46=\"Eur\",CODICI!D157,CODICI!D157*SELECTION!$C$48)","v":{"v":1248,"d":"€ 1,248.00"}}]
[153,"UE003XK001",{"$f":"VLOOKUP(B158,LINGUA!$B:$H,2,0)","v":"humiSteam X-plus 3 kg/h, 230Vac 3~, with regulation, disposable cylinder"},{"v":1211,"d":"€ 1,211.00"},null,{"$f":"IF(SELECTION!$C$46=\"Eur\",CODICI!D158,CODICI!D158*SELECTION!$C$48)","v":{"v":1211,"d":"€ 1,211.00"}}]
[154,"UE003XKC01",{"$f":"VLOOKUP(B159,LINGUA!$B:$H,2,0)","v":"humiSteam X-plus 3 kg/h, 230Vac 3~, with regulation, cleanable cylinder"},{"v":1242,"d":"€ 1,242.00"},null,{"$f":"IF(SELECTION!$C$46=\"Eur\",CODICI!D159,CODICI!D159*SELECTION!$C$48)","v":{"v":1242,"d":"€ 1,242.00"}}]
[155,"UE003XL001",{"$f":"VLOOKUP(B160,LINGUA!$B:$H,2,0)","v":"humiSteam X-plus 3 kg/h, 400Vac 3~, with regulation, disposable cylinder"},{"v":1210,"d":"€ 1,210.00"},null,{"$f":"IF(SELECTION!$C$46=\"Eur\",CODICI!D160,CODICI!D160*SELECTION!$C$48)","v":{"v":1210,"d":"€ 1,210.00"}}]
[156,"UE003XLC01",{"$f":"VLOOKUP(B161,LINGUA!$B:$H,2,0)","v":"humiSteam X-plus 3 kg/h, 400Vac 3~, with regulation, cleanable cylinder"},{"v":1241,"d":"€ 1,241.00"},null,{"$f":"IF(SELECTION!$C$46=\"Eur\",CODICI!D161,CODICI!D161*SELECTION!$C$48)","v":{"v":1241,"d":"€ 1,241.00"}}]
[157,"UE003XM001",{"$f":"VLOOKUP(B162,LINGUA!$B:$H,2,0)","v":"humiSteam X-plus 3 kg/h, 460Vac 3~, with regulation, disposable cylinder"},{"v":1211,"d":"€ 1,211.00"},null,{"$f":"IF(SELECTION!$C$46=\"Eur\",CODICI!D162,CODICI!D162*SELECTION!$C$48)","v":{"v":1211,"d":"€ 1,211.00"}}]
[158,"UE003XMC01",{"$f":"VLOOKUP(B163,LINGUA!$B:$H,2,0)","v":"humiSteam X-plus 3 kg/h, 460Vac 3~, with regulation, cleanable cylinder"},{"v":1241,"d":"€ 1,241.00"},null,{"$f":"IF(SELECTION!$C$46=\"Eur\",CODICI!D163,CODICI!D163*SELECTION!$C$48)","v":{"v":1241,"d":"€ 1,241.00"}}]
[159,"UE003XU001",{"$f":"VLOOKUP(B164,LINGUA!$B:$H,2,0)","v":"humiSteam X-plus 3 kg/h, 208Vac 1~, with regulation, disposable cylinder"},{"v":1210,"d":"€ 1,210.00"},null,{"$f":"IF(SELECTION!$C$46=\"Eur\",CODICI!D164,CODICI!D164*SELECTION!$C$48)","v":{"v":1210,"d":"€ 1,210.00"}}]
[160,"UE003XUC01",{"$f":"VLOOKUP(B165,LINGUA!$B:$H,2,0)","v":"humiSteam X-plus 3 kg/h, 208Vac 1~, with regulation, cleanable cylinder"},{"v":1241,"d":"€ 1,241.00"},null,{"$f":"IF(SELECTION!$C$46=\"Eur\",CODICI!D165,CODICI!D165*SELECTION!$C$48)","v":{"v":1241,"d":"€ 1,241.00"}}]
[161,"UE003XW001",{"$f":"VLOOKUP(B166,LINGUA!$B:$H,2,0)","v":"humiSteam X-plus 3 kg/h, 208Vac 3~, with regulation, disposable cylinder"},{"v":1210,"d":"€ 1,210.00"},null,{"$f":"IF(SELECTION!$C$46=\"Eur\",CODICI!D166,CODICI!D166*SELECTION!$C$48)","v":{"v":1210,"d":"€ 1,210.00"}}]
[162,"UE003XWC01",{"$f":"VLOOKUP(B167,LINGUA!$B:$H,2,0)","v":"humiSteam X-plus 3 kg/h, 208Vac 3~, with regulation, cleanable cylinder"},{"v":1241,"d":"€ 1,241.00"},null,{"$f":"IF(SELECTION!$C$46=\"Eur\",CODICI!D167,CODICI!D167*SELECTION!$C$48)","v":{"v":1241,"d":"€ 1,241.00"}}]
[163,"UE005XD001",{"$f":"VLOOKUP(B168,LINGUA!$B:$H,2,0)","v":"humiSteam X-plus 5 kg/h, 230Vac 1~, with regulation, disposable cylinder"},{"v":1338,"d":"€ 1,338.00"},null,{"$f":"IF(SELECTION!$C$46=\"Eur\",CODICI!D168,CODICI!D168*SELECTION!$C$48)","v":{"v":1338,"d":"€ 1,338.00"}}]
[164,"UE005XDC01",{"$f":"VLOOKUP(B169,LINGUA!$B:$H,2,0)","v":"humiSteam X-plus 5 kg/h, 230Vac 1~, with regulation, cleanable cylinder"},{"v":1404,"d":"€ 1,404.00"},null,{"$f":"IF(SELECTION!$C$46=\"Eur\",CODICI!D169,CODICI!D169*SELECTION!$C$48)","v":{"v":1404,"d":"€ 1,404.00"}}]
[165,"UE005XK001",{"$f":"VLOOKUP(B170,LINGUA!$B:$H,2,0)","v":"humiSteam X-plus 5 kg/h, 230Vac 3~, with regulation, disposable cylinder"},{"v":1338,"d":"€ 1,338.00"},null,{"$f":"IF(SELECTION!$C$46=\"Eur\",CODICI!D170,CODICI!D170*SELECTION!$C$48)","v":{"v":1338,"d":"€ 1,338.00"}}]
[166,"UE005XKC01",{"$f":"VLOOKUP(B171,LINGUA!$B:$H,2,0)","v":"humiSteam X-plus 5 kg/h, 230Vac 3~, with regulation, cleanable cylinder"},{"v":1369,"d":"€ 1,369.00"},null,{"$f":"IF(SELECTION!$C$46=\"Eur\",CODICI!D171,CODICI!D171*SELECTION!$C$48)","v":{"v":1369,"d":"€ 1,369.00"}}]
[167,"UE005XL001",{"$f":"VLOOKUP(B172,LINGUA!$B:$H,2,0)","v":"humiSteam X-plus 5 kg/h, 400Vac 3~, with regulation, disposable cylinder"},{"v":1338,"d":"€ 1,338.00"},null,{"$f":"IF(SELECTION!$C$46=\"Eur\",CODICI!D172,CODICI!D172*SELECTION!$C$48)","v":{"v":1338,"d":"€ 1,338.00"}}]
[168,"UE005XLC01",{"$f":"VLOOKUP(B173,LINGUA!$B:$H,2,0)","v":"humiSteam X-plus 5 kg/h, 400Vac 3~, with regulation, cleanable cylinder"},{"v":1369,"d":"€ 1,369.00"},null,{"$f":"IF(SELECTION!$C$46=\"Eur\",CODICI!D173,CODICI!D173*SELECTION!$C$48)","v":{"v":1369,"d":"€ 1,369.00"}}]
[169,"UE005XM001",{"$f":"VLOOKUP(B174,LINGUA!$B:$H,2,0)","v":"humiSteam X-plus 5 kg/h, 460Vac 3~, with regulation, disposable cylinder"},{"v":1338,"d":"€ 1,338.00"},null,{"$f":"IF(SELECTION!$C$46=\"Eur\",CODICI!D174,CODICI!D174*SELECTION!$C$48)","v":{"v":1338,"d":"€ 1,338.00"}}]
[170,"UE005XMC01",{"$f":"VLOOKUP(B175,LINGUA!$B:$H,2,0)","v":"humiSteam X-plus 5 kg/h, 460Vac 3~, with regulation, cleanable cylinder"},{"v":1369,"d":"€ 1,369.00"},null,{"$f":"IF(SELECTION!$C$46=\"Eur\",CODICI!D175,CODICI!D175*SELECTION!$C$48)","v":{"v":1369,"d":"€ 1,369.00"}}]
[171,"UE005XN001",{"$f":"VLOOKUP(B176,LINGUA!$B:$H,2,0)","v":"humiSteam X-plus 5 kg/h, 575Vac 3~, with regulation, disposable cylinder"},{"v":1338,"d":"€ 1,338.00"},null,{"$f":"IF(SELECTION!$C$46=\"Eur\",CODICI!D176,CODICI!D176*SELECTION!$C$48)","v":{"v":1338,"d":"€ 1,338.00"}}]
[172,"UE005XNC01",{"$f":"VLOOKUP(B177,LINGUA!$B:$H,2,0)","v":"humiSteam X-plus 5 kg/h, 575Vac 3~, with regulation, cleanable cylinder"},{"v":1369,"d":"€ 1,369.00"},null,{"$f":"IF(SELECTION!$C$46=\"Eur\",CODICI!D177,CODICI!D177*SELECTION!$C$48)","v":{"v":1369,"d":"€ 1,369.00"}}]
[173,"UE005XU001",{"$f":"VLOOKUP(B178,LINGUA!$B:$H,2,0)","v":"humiSteam X-plus 5 kg/h, 208Vac 1~, with regulation, disposable cylinder"},{"v":1338,"d":"€ 1,338.00"},null,{"$f":"IF(SELECTION!$C$46=\"Eur\",CODICI!D178,CODICI!D178*SELECTION!$C$48)","v":{"v":1338,"d":"€ 1,338.00"}}]
[174,"UE005XUC01",{"$f":"VLOOKUP(B179,LINGUA!$B:$H,2,0)","v":"humiSteam X-plus 5 kg/h, 208Vac 1~, with regulation, cleanable cylinder"},{"v":1404,"d":"€ 1,404.00"},null,{"$f":"IF(SELECTION!$C$46=\"Eur\",CODICI!D179,CODICI!D179*SELECTION!$C$48)","v":{"v":1404,"d":"€ 1,404.00"}}]
[175,"UE005XW001",{"$f":"VLOOKUP(B180,LINGUA!$B:$H,2,0)","v":"humiSteam X-plus 5 kg/h, 208Vac 3~, with regulation, disposable cylinder"},{"v":1338,"d":"€ 1,338.00"},null,{"$f":"IF(SELECTION!$C$46=\"Eur\",CODICI!D180,CODICI!D180*SELECTION!$C$48)","v":{"v":1338,"d":"€ 1,338.00"}}]
[176,"UE005XWC01",{"$f":"VLOOKUP(B181,LINGUA!$B:$H,2,0)","v":"humiSteam X-plus 5 kg/h, 208Vac 3~, with regulation, cleanable cylinder"},{"v":1369,"d":"€ 1,369.00"},null,{"$f":"IF(SELECTION!$C$46=\"Eur\",CODICI!D181,CODICI!D181*SELECTION!$C$48)","v":{"v":1369,"d":"€ 1,369.00"}}]
[177,"UE008XK001",{"$f":"VLOOKUP(B182,LINGUA!$B:$H,2,0)","v":"humiSteam X-plus 8 kg/h, 230Vac 3~, with regulation, disposable cylinder"},{"v":1433,"d":"€ 1,433.00"},null,{"$f":"IF(SELECTION!$C$46=\"Eur\",CODICI!D182,CODICI!D182*SELECTION!$C$48)","v":{"v":1433,"d":"€ 1,433.00"}}]
[178,"UE008XKC01",{"$f":"VLOOKUP(B183,LINGUA!$B:$H,2,0)","v":"humiSteam X-plus 8 kg/h, 230Vac 3~, with regulation, cleanable cylinder"},{"v":1485,"d":"€ 1,485.00"},null,{"$f":"IF(SELECTION!$C$46=\"Eur\",CODICI!D183,CODICI!D183*SELECTION!$C$48)","v":{"v":1485,"d":"€ 1,485.00"}}]
[179,"UE008XL001",{"$f":"VLOOKUP(B184,LINGUA!$B:$H,2,0)","v":"humiSteam X-plus 8 kg/h, 400Vac 3~, with regulation, disposable cylinder"},{"v":1433,"d":"€ 1,433.00"},null,{"$f":"IF(SELECTION!$C$46=\"Eur\",CODICI!D184,CODICI!D184*SELECTION!$C$48)","v":{"v":1433,"d":"€ 1,433.00"}}]
[180,"UE008XLC01",{"$f":"VLOOKUP(B185,LINGUA!$B:$H,2,0)","v":"humiSteam X-plus 8 kg/h, 400Vac 3~, with regulation, cleanable cylinder"},{"v":1485,"d":"€ 1,485.00"},null,{"$f":"IF(SELECTION!$C$46=\"Eur\",CODICI!D185,CODICI!D185*SELECTION!$C$48)","v":{"v":1485,"d":"€ 1,485.00"}}]
[181,"UE008XM001",{"$f":"VLOOKUP(B186,LINGUA!$B:$H,2,0)","v":"humiSteam X-plus 8 kg/h, 460Vac 3~, with regulation, disposable cylinder"},{"v":1433,"d":"€ 1,433.00"},null,{"$f":"IF(SELECTION!$C$46=\"Eur\",CODICI!D186,CODICI!D186*SELECTION!$C$48)","v":{"v":1433,"d":"€ 1,433.00"}}]
[182,"UE008XMC01",{"$f":"VLOOKUP(B187,LINGUA!$B:$H,2,0)","v":"humiSteam X-plus 8 kg/h, 460Vac 3~, with regulation, cleanable cylinder"},{"v":1485,"d":"€ 1,485.00"},null,{"$f":"IF(SELECTION!$C$46=\"Eur\",CODICI!D187,CODICI!D187*SELECTION!$C$48)","v":{"v":1485,"d":"€ 1,485.00"}}]
[183,"UE008XN001",{"$f":"VLOOKUP(B188,LINGUA!$B:$H,2,0)","v":"humiSteam X-plus 8 kg/h, 575Vac 3~, with regulation, disposable cylinder"},{"v":1433,"d":"€ 1,433.00"},null,{"$f":"IF(SELECTION!$C$46=\"Eur\",CODICI!D188,CODICI!D188*SELECTION!$C$48)","v":{"v":1433,"d":"€ 1,433.00"}}]
[184,"UE008XNC01",{"$f":"VLOOKUP(B189,LINGUA!$B:$H,2,0)","v":"humiSteam X-plus 8 kg/h, 575Vac 3~, with regulation, cleanable cylinder"},{"v":1485,"d":"€ 1,485.00"},null,{"$f":"IF(SELECTION!$C$46=\"Eur\",CODICI!D189,CODICI!D189*SELECTION!$C$48)","v":{"v":1485,"d":"€ 1,485.00"}}]
[185,"UE008XW001",{"$f":"VLOOKUP(B190,LINGUA!$B:$H,2,0)","v":"humiSteam X-plus 8 kg/h, 208Vac 3~, with regulation, disposable cylinder"},{"v":1433,"d":"€ 1,433.00"},null,{"$f":"IF(SELECTION!$C$46=\"Eur\",CODICI!D190,CODICI!D190*SELECTION!$C$48)","v":{"v":1433,"d":"€ 1,433.00"}}]
[186,"UE008XWC01",{"$f":"VLOOKUP(B191,LINGUA!$B:$H,2,0)","v":"humiSteam X-plus 8 kg/h, 208Vac 3~, with regulation, cleanable cylinder"},{"v":1485,"d":"€ 1,485.00"},null,{"$f":"IF(SELECTION!$C$46=\"Eur\",CODICI!D191,CODICI!D191*SELECTION!$C$48)","v":{"v":1485,"d":"€ 1,485.00"}}]
[187,"UE009XD001",{"$f":"VLOOKUP(B192,LINGUA!$B:$H,2,0)","v":"humiSteam X-plus 9 kg/h, 230Vac 1~, with regulation, disposable cylinder"},{"v":1501,"d":"€ 1,501.00"},null,{"$f":"IF(SELECTION!$C$46=\"Eur\",CODICI!D192,CODICI!D192*SELECTION!$C$48)","v":{"v":1501,"d":"€ 1,501.00"}}]
[188,"UE009XDC01",{"$f":"VLOOKUP(B193,LINGUA!$B:$H,2,0)","v":"humiSteam X-plus 9 kg/h, 230Vac 1~, with regulation, cleanable cylinder"},{"v":1566,"d":"€ 1,566.00"},null,{"$f":"IF(SELECTION!$C$46=\"Eur\",CODICI!D193,CODICI!D193*SELECTION!$C$48)","v":{"v":1566,"d":"€ 1,566.00"}}]
[189,"UE009XU001",{"$f":"VLOOKUP(B194,LINGUA!$B:$H,2,0)","v":"humiSteam X-plus 9 kg/h, 208Vac 1~, with regulation, disposable cylinder"},{"v":1501,"d":"€ 1,501.00"},null,{"$f":"IF(SELECTION!$C$46=\"Eur\",CODICI!D194,CODICI!D194*SELECTION!$C$48)","v":{"v":1501,"d":"€ 1,501.00"}}]
[190,"UE009XUC01",{"$f":"VLOOKUP(B195,LINGUA!$B:$H,2,0)","v":"humiSteam X-plus 9 kg/h, 208Vac 1~, with regulation, cleanable cylinder"},{"v":1566,"d":"€ 1,566.00"},null,{"$f":"IF(SELECTION!$C$46=\"Eur\",CODICI!D195,CODICI!D195*SELECTION!$C$48)","v":{"v":1566,"d":"€ 1,566.00"}}]
[191,"UE010XK001",{"$f":"VLOOKUP(B196,LINGUA!$B:$H,2,0)","v":"humiSteam X-plus 10 kg/h, 230Vac 3~, with regulation, disposable cylinder"},{"v":1472,"d":"€ 1,472.00"},null,{"$f":"IF(SELECTION!$C$46=\"Eur\",CODICI!D196,CODICI!D196*SELECTION!$C$48)","v":{"v":1472,"d":"€ 1,472.00"}}]
[192,"UE010XKC01",{"$f":"VLOOKUP(B197,LINGUA!$B:$H,2,0)","v":"humiSteam X-plus 10 kg/h, 230Vac 3~, with regulation, cleanable cylinder"},{"v":1557,"d":"€ 1,557.00"},null,{"$f":"IF(SELECTION!$C$46=\"Eur\",CODICI!D197,CODICI!D197*SELECTION!$C$48)","v":{"v":1557,"d":"€ 1,557.00"}}]
[193,"UE010XL001",{"$f":"VLOOKUP(B198,LINGUA!$B:$H,2,0)","v":"humiSteam X-plus 10 kg/h, 400Vac 3~, with regulation, disposable cylinder"},{"v":1472,"d":"€ 1,472.00"},null,{"$f":"IF(SELECTION!$C$46=\"Eur\",CODICI!D198,CODICI!D198*SELECTION!$C$48)","v":{"v":1472,"d":"€ 1,472.00"}}]
[194,"UE010XLC01",{"$f":"VLOOKUP(B199,LINGUA!$B:$H,2,0)","v":"humiSteam X-plus 10 kg/h, 400Vac 3~, with regulation, cleanable cylinder"},{"v":1556,"d":"€ 1,556.00"},null,{"$f":"IF(SELECTION!$C$46=\"Eur\",CODICI!D199,CODICI!D199*SELECTION!$C$48)","v":{"v":1556,"d":"€ 1,556.00"}}]
[{"$f":"+A199+1","v":195},"UE010XM001",{"$f":"VLOOKUP(B200,LINGUA!$B:$H,2,0)","v":"humiSteam X-plus 10 kg/h, 460Vac 3~, with regulation, disposable cylinder"},{"v":1472,"d":"€ 1,472.00"},null,{"$f":"IF(SELECTION!$C$46=\"Eur\",CODICI!D200,CODICI!D200*SELECTION!$C$48)","v":{"v":1472,"d":"€ 1,472.00"}}]
[196,"UE010XMC01",{"$f":"VLOOKUP(B201,LINGUA!$B:$H,2,0)","v":"humiSteam X-plus 10 kg/h, 460Vac 3~, with regulation, cleanable cylinder"},{"v":1557,"d":"€ 1,557.00"},null,{"$f":"IF(SELECTION!$C$46=\"Eur\",CODICI!D201,CODICI!D201*SELECTION!$C$48)","v":{"v":1557,"d":"€ 1,557.00"}}]
[197,"UE010XN001",{"$f":"VLOOKUP(B202,LINGUA!$B:$H,2,0)","v":"humiSteam X-plus 10 kg/h, 575Vac 3~, with regulation, disposable cylinder"},{"v":1472,"d":"€ 1,472.00"},null,{"$f":"IF(SELECTION!$C$46=\"Eur\",CODICI!D202,CODICI!D202*SELECTION!$C$48)","v":{"v":1472,"d":"€ 1,472.00"}}]
[198,"UE010XNC01",{"$f":"VLOOKUP(B203,LINGUA!$B:$H,2,0)","v":"humiSteam X-plus 10 kg/h, 575Vac 3~, with regulation, cleanable cylinder"},{"v":1557,"d":"€ 1,557.00"},null,{"$f":"IF(SELECTION!$C$46=\"Eur\",CODICI!D203,CODICI!D203*SELECTION!$C$48)","v":{"v":1557,"d":"€ 1,557.00"}}]
[199,"UE010XW001",{"$f":"VLOOKUP(B204,LINGUA!$B:$H,2,0)","v":"humiSteam X-plus 10 kg/h, 208Vac 3~, with regulation, disposable cylinder"},{"v":1472,"d":"€ 1,472.00"},null,{"$f":"IF(SELECTION!$C$46=\"Eur\",CODICI!D204,CODICI!D204*SELECTION!$C$48)","v":{"v":1472,"d":"€ 1,472.00"}}]
[200,"UE010XWC01",{"$f":"VLOOKUP(B205,LINGUA!$B:$H,2,0)","v":"humiSteam X-plus 10 kg/h, 208Vac 3~, with regulation, cleanable cylinder"},{"v":1557,"d":"€ 1,557.00"},null,{"$f":"IF(SELECTION!$C$46=\"Eur\",CODICI!D205,CODICI!D205*SELECTION!$C$48)","v":{"v":1557,"d":"€ 1,557.00"}}]
[201,"UE015XK001",{"$f":"VLOOKUP(B206,LINGUA!$B:$H,2,0)","v":"humiSteam X-plus 15 kg/h, 230Vac 3~, with regulation, disposable cylinder"},{"v":1520,"d":"€ 1,520.00"},null,{"$f":"IF(SELECTION!$C$46=\"Eur\",CODICI!D206,CODICI!D206*SELECTION!$C$48)","v":{"v":1520,"d":"€ 1,520.00"}}]
[202,"UE015XKC01",{"$f":"VLOOKUP(B207,LINGUA!$B:$H,2,0)","v":"humiSteam X-plus 15 kg/h, 230Vac 3~, with regulation, cleanable cylinder"},{"v":1607,"d":"€ 1,607.00"},null,{"$f":"IF(SELECTION!$C$46=\"Eur\",CODICI!D207,CODICI!D207*SELECTION!$C$48)","v":{"v":1607,"d":"€ 1,607.00"}}]
[203,"UE015XL001",{"$f":"VLOOKUP(B208,LINGUA!$B:$H,2,0)","v":"humiSteam X-plus 15 kg/h, 400Vac 3~, with regulation, disposable cylinder"},{"v":1520,"d":"€ 1,520.00"},null,{"$f":"IF(SELECTION!$C$46=\"Eur\",CODICI!D208,CODICI!D208*SELECTION!$C$48)","v":{"v":1520,"d":"€ 1,520.00"}}]
[204,"UE015XLC01",{"$f":"VLOOKUP(B209,LINGUA!$B:$H,2,0)","v":"humiSteam X-plus 15 kg/h, 400Vac 3~, with regulation, cleanable cylinder"},{"v":1606,"d":"€ 1,606.00"},null,{"$f":"IF(SELECTION!$C$46=\"Eur\",CODICI!D209,CODICI!D209*SELECTION!$C$48)","v":{"v":1606,"d":"€ 1,606.00"}}]
[205,"UE015XM001",{"$f":"VLOOKUP(B210,LINGUA!$B:$H,2,0)","v":"humiSteam X-plus 15 kg/h, 460Vac 3~, with regulation, disposable cylinder"},{"v":1520,"d":"€ 1,520.00"},null,{"$f":"IF(SELECTION!$C$46=\"Eur\",CODICI!D210,CODICI!D210*SELECTION!$C$48)","v":{"v":1520,"d":"€ 1,520.00"}}]
[206,"UE015XMC01",{"$f":"VLOOKUP(B211,LINGUA!$B:$H,2,0)","v":"humiSteam X-plus 15 kg/h, 460Vac 3~, with regulation, cleanable cylinder"},{"v":1607,"d":"€ 1,607.00"},null,{"$f":"IF(SELECTION!$C$46=\"Eur\",CODICI!D211,CODICI!D211*SELECTION!$C$48)","v":{"v":1607,"d":"€ 1,607.00"}}]
[207,"UE015XN001",{"$f":"VLOOKUP(B212,LINGUA!$B:$H,2,0)","v":"humiSteam X-plus 15 kg/h, 575Vac 3~, with regulation, disposable cylinder"},{"v":1520,"d":"€ 1,520.00"},null,{"$f":"IF(SELECTION!$C$46=\"Eur\",CODICI!D212,CODICI!D212*SELECTION!$C$48)","v":{"v":1520,"d":"€ 1,520.00"}}]
[208,"UE015XNC01",{"$f":"VLOOKUP(B213,LINGUA!$B:$H,2,0)","v":"humiSteam X-plus 15 kg/h, 575Vac 3~, with regulation, cleanable cylinder"},{"v":1607,"d":"€ 1,607.00"},null,{"$f":"IF(SELECTION!$C$46=\"Eur\",CODICI!D213,CODICI!D213*SELECTION!$C$48)","v":{"v":1607,"d":"€ 1,607.00"}}]
[209,"UE015XW001",{"$f":"VLOOKUP(B214,LINGUA!$B:$H,2,0)","v":"humiSteam X-plus 15 kg/h, 208Vac 3~, with regulation, disposable cylinder"},{"v":1520,"d":"€ 1,520.00"},null,{"$f":"IF(SELECTION!$C$46=\"Eur\",CODICI!D214,CODICI!D214*SELECTION!$C$48)","v":{"v":1520,"d":"€ 1,520.00"}}]
[210,"UE015XWC01",{"$f":"VLOOKUP(B215,LINGUA!$B:$H,2,0)","v":"humiSteam X-plus 15 kg/h, 208Vac 3~, with regulation, cleanable cylinder"},{"v":1607,"d":"€ 1,607.00"},null,{"$f":"IF(SELECTION!$C$46=\"Eur\",CODICI!D215,CODICI!D215*SELECTION!$C$48)","v":{"v":1607,"d":"€ 1,607.00"}}]
[211,"UE018XL001",{"$f":"VLOOKUP(B216,LINGUA!$B:$H,2,0)","v":"humiSteam X-plus 18 kg/h, 400Vac 3~, with regulation, disposable cylinder"},{"v":1564,"d":"€ 1,564.00"},null,{"$f":"IF(SELECTION!$C$46=\"Eur\",CODICI!D216,CODICI!D216*SELECTION!$C$48)","v":{"v":1564,"d":"€ 1,564.00"}}]
[212,"UE018XLC01",{"$f":"VLOOKUP(B217,LINGUA!$B:$H,2,0)","v":"humiSteam X-plus 18 kg/h, 400Vac 3~, with regulation, cleanable cylinder"},{"v":1629,"d":"€ 1,629.00"},null,{"$f":"IF(SELECTION!$C$46=\"Eur\",CODICI!D217,CODICI!D217*SELECTION!$C$48)","v":{"v":1629,"d":"€ 1,629.00"}}]
[213,"UE018XM001",{"$f":"VLOOKUP(B218,LINGUA!$B:$H,2,0)","v":"humiSteam X-plus 18 kg/h, 460Vac 3~, with regulation, disposable cylinder"},{"v":1565,"d":"€ 1,565.00"},null,{"$f":"IF(SELECTION!$C$46=\"Eur\",CODICI!D218,CODICI!D218*SELECTION!$C$48)","v":{"v":1565,"d":"€ 1,565.00"}}]
[214,"UE018XMC01",{"$f":"VLOOKUP(B219,LINGUA!$B:$H,2,0)","v":"humiSteam X-plus 18 kg/h, 460Vac 3~, with regulation, cleanable cylinder"},{"v":1629,"d":"€ 1,629.00"},null,{"$f":"IF(SELECTION!$C$46=\"Eur\",CODICI!D219,CODICI!D219*SELECTION!$C$48)","v":{"v":1629,"d":"€ 1,629.00"}}]
[215,"UE018XN001",{"$f":"VLOOKUP(B220,LINGUA!$B:$H,2,0)","v":"humiSteam X-plus 18 kg/h, 575Vac 3~, with regulation, disposable cylinder"},{"v":1564,"d":"€ 1,564.00"},null,{"$f":"IF(SELECTION!$C$46=\"Eur\",CODICI!D220,CODICI!D220*SELECTION!$C$48)","v":{"v":1564,"d":"€ 1,564.00"}}]
[216,"UE018XNC01",{"$f":"VLOOKUP(B221,LINGUA!$B:$H,2,0)","v":"humiSteam X-plus 18 kg/h, 575Vac 3~, with regulation, cleanable cylinder"},{"v":1629,"d":"€ 1,629.00"},null,{"$f":"IF(SELECTION!$C$46=\"Eur\",CODICI!D221,CODICI!D221*SELECTION!$C$48)","v":{"v":1629,"d":"€ 1,629.00"}}]
[217,"UE025XK001",{"$f":"VLOOKUP(B222,LINGUA!$B:$H,2,0)","v":"humiSteam X-plus 25 kg/h, 230Vac 3~, with regulation, disposable cylinder"},{"v":2032,"d":"€ 2,032.00"},null,{"$f":"IF(SELECTION!$C$46=\"Eur\",CODICI!D222,CODICI!D222*SELECTION!$C$48)","v":{"v":2032,"d":"€ 2,032.00"}}]
[218,"UE025XKC01",{"$f":"VLOOKUP(B223,LINGUA!$B:$H,2,0)","v":"humiSteam X-plus 25 kg/h, 230Vac 3~, with regulation, cleanable cylinder"},{"v":2100,"d":"€ 2,100.00"},null,{"$f":"IF(SELECTION!$C$46=\"Eur\",CODICI!D223,CODICI!D223*SELECTION!$C$48)","v":{"v":2100,"d":"€ 2,100.00"}}]
[219,"UE025XL001",{"$f":"VLOOKUP(B224,LINGUA!$B:$H,2,0)","v":"humiSteam X-plus 25 kg/h, 400Vac 3~, with regulation, disposable cylinder"},{"v":2031,"d":"€ 2,031.00"},null,{"$f":"IF(SELECTION!$C$46=\"Eur\",CODICI!D224,CODICI!D224*SELECTION!$C$48)","v":{"v":2031,"d":"€ 2,031.00"}}]
[220,"UE025XLC01",{"$f":"VLOOKUP(B225,LINGUA!$B:$H,2,0)","v":"humiSteam X-plus 25 kg/h, 400Vac 3~, with regulation, cleanable cylinder"},{"v":2099,"d":"€ 2,099.00"},null,{"$f":"IF(SELECTION!$C$46=\"Eur\",CODICI!D225,CODICI!D225*SELECTION!$C$48)","v":{"v":2099,"d":"€ 2,099.00"}}]
[221,"UE025XM001",{"$f":"VLOOKUP(B226,LINGUA!$B:$H,2,0)","v":"humiSteam X-plus 25 kg/h, 460Vac 3~, with regulation, disposable cylinder"},{"v":2032,"d":"€ 2,032.00"},null,{"$f":"IF(SELECTION!$C$46=\"Eur\",CODICI!D226,CODICI!D226*SELECTION!$C$48)","v":{"v":2032,"d":"€ 2,032.00"}}]
[222,"UE025XMC01",{"$f":"VLOOKUP(B227,LINGUA!$B:$H,2,0)","v":"humiSteam X-plus 25 kg/h, 460Vac 3~, with regulation, cleanable cylinder"},{"v":2100,"d":"€ 2,100.00"},null,{"$f":"IF(SELECTION!$C$46=\"Eur\",CODICI!D227,CODICI!D227*SELECTION!$C$48)","v":{"v":2100,"d":"€ 2,100.00"}}]
[223,"UE025XN001",{"$f":"VLOOKUP(B228,LINGUA!$B:$H,2,0)","v":"humiSteam X-plus 25 kg/h, 575Vac 3~, with regulation, disposable cylinder"},{"v":2032,"d":"€ 2,032.00"},null,{"$f":"IF(SELECTION!$C$46=\"Eur\",CODICI!D228,CODICI!D228*SELECTION!$C$48)","v":{"v":2032,"d":"€ 2,032.00"}}]
[224,"UE025XNC01",{"$f":"VLOOKUP(B229,LINGUA!$B:$H,2,0)","v":"humiSteam X-plus 25 kg/h, 575Vac 3~, with regulation, cleanable cylinder"},{"v":2100,"d":"€ 2,100.00"},null,{"$f":"IF(SELECTION!$C$46=\"Eur\",CODICI!D229,CODICI!D229*SELECTION!$C$48)","v":{"v":2100,"d":"€ 2,100.00"}}]
[225,"UE025XW001",{"$f":"VLOOKUP(B230,LINGUA!$B:$H,2,0)","v":"humiSteam X-plus 25 kg/h, 208Vac 3~, with regulation, disposable cylinder"},{"v":2032,"d":"€ 2,032.00"},null,{"$f":"IF(SELECTION!$C$46=\"Eur\",CODICI!D230,CODICI!D230*SELECTION!$C$48)","v":{"v":2032,"d":"€ 2,032.00"}}]
[226,"UE025XWC01",{"$f":"VLOOKUP(B231,LINGUA!$B:$H,2,0)","v":"humiSteam X-plus 25 kg/h, 208Vac 3~, with regulation, cleanable cylinder"},{"v":2100,"d":"€ 2,100.00"},null,{"$f":"IF(SELECTION!$C$46=\"Eur\",CODICI!D231,CODICI!D231*SELECTION!$C$48)","v":{"v":2100,"d":"€ 2,100.00"}}]
[227,"UE035XK001",{"$f":"VLOOKUP(B232,LINGUA!$B:$H,2,0)","v":"humiSteam X-plus 35 kg/h, 230Vac 3~, with regulation, disposable cylinder"},{"v":2308,"d":"€ 2,308.00"},null,{"$f":"IF(SELECTION!$C$46=\"Eur\",CODICI!D232,CODICI!D232*SELECTION!$C$48)","v":{"v":2308,"d":"€ 2,308.00"}}]
[228,"UE035XKC01",{"$f":"VLOOKUP(B233,LINGUA!$B:$H,2,0)","v":"humiSteam X-plus 35 kg/h, 230Vac 3~, with regulation, cleanable cylinder"},{"v":2376,"d":"€ 2,376.00"},null,{"$f":"IF(SELECTION!$C$46=\"Eur\",CODICI!D233,CODICI!D233*SELECTION!$C$48)","v":{"v":2376,"d":"€ 2,376.00"}}]
[229,"UE035XL001",{"$f":"VLOOKUP(B234,LINGUA!$B:$H,2,0)","v":"humiSteam X-plus 35 kg/h, 400Vac 3~, with regulation, disposable cylinder"},{"v":2307,"d":"€ 2,307.00"},null,{"$f":"IF(SELECTION!$C$46=\"Eur\",CODICI!D234,CODICI!D234*SELECTION!$C$48)","v":{"v":2307,"d":"€ 2,307.00"}}]
[230,"UE035XLC01",{"$f":"VLOOKUP(B235,LINGUA!$B:$H,2,0)","v":"humiSteam X-plus 35 kg/h, 400Vac 3~, with regulation, cleanable cylinder"},{"v":2375,"d":"€ 2,375.00"},null,{"$f":"IF(SELECTION!$C$46=\"Eur\",CODICI!D235,CODICI!D235*SELECTION!$C$48)","v":{"v":2375,"d":"€ 2,375.00"}}]
[231,"UE035XM001",{"$f":"VLOOKUP(B236,LINGUA!$B:$H,2,0)","v":"humiSteam X-plus 35 kg/h, 460Vac 3~, with regulation, disposable cylinder"},{"v":2308,"d":"€ 2,308.00"},null,{"$f":"IF(SELECTION!$C$46=\"Eur\",CODICI!D236,CODICI!D236*SELECTION!$C$48)","v":{"v":2308,"d":"€ 2,308.00"}}]
[232,"UE035XMC01",{"$f":"VLOOKUP(B237,LINGUA!$B:$H,2,0)","v":"humiSteam X-plus 35 kg/h, 460Vac 3~, with regulation, cleanable cylinder"},{"v":2376,"d":"€ 2,376.00"},null,{"$f":"IF(SELECTION!$C$46=\"Eur\",CODICI!D237,CODICI!D237*SELECTION!$C$48)","v":{"v":2376,"d":"€ 2,376.00"}}]
[233,"UE035XN001",{"$f":"VLOOKUP(B238,LINGUA!$B:$H,2,0)","v":"humiSteam X-plus 35 kg/h, 575Vac 3~, with regulation, disposable cylinder"},{"v":2308,"d":"€ 2,308.00"},null,{"$f":"IF(SELECTION!$C$46=\"Eur\",CODICI!D238,CODICI!D238*SELECTION!$C$48)","v":{"v":2308,"d":"€ 2,308.00"}}]
[234,"UE035XNC01",{"$f":"VLOOKUP(B239,LINGUA!$B:$H,2,0)","v":"humiSteam X-plus 35 kg/h, 575Vac 3~, with regulation, cleanable cylinder"},{"v":2376,"d":"€ 2,376.00"},null,{"$f":"IF(SELECTION!$C$46=\"Eur\",CODICI!D239,CODICI!D239*SELECTION!$C$48)","v":{"v":2376,"d":"€ 2,376.00"}}]
[235,"UE035XW001",{"$f":"VLOOKUP(B240,LINGUA!$B:$H,2,0)","v":"humiSteam X-plus 35 kg/h, 208Vac 3~, with regulation, disposable cylinder"},{"v":2308,"d":"€ 2,308.00"},null,{"$f":"IF(SELECTION!$C$46=\"Eur\",CODICI!D240,CODICI!D240*SELECTION!$C$48)","v":{"v":2308,"d":"€ 2,308.00"}}]
[236,"UE035XWC01",{"$f":"VLOOKUP(B241,LINGUA!$B:$H,2,0)","v":"humiSteam X-plus 35 kg/h, 208Vac 3~, with regulation, cleanable cylinder"},{"v":2376,"d":"€ 2,376.00"},null,{"$f":"IF(SELECTION!$C$46=\"Eur\",CODICI!D241,CODICI!D241*SELECTION!$C$48)","v":{"v":2376,"d":"€ 2,376.00"}}]
[237,"UE045XK001",{"$f":"VLOOKUP(B242,LINGUA!$B:$H,2,0)","v":"humiSteam X-plus 45 kg/h, 230Vac 3~, with regulation, disposable cylinder"},{"v":2538,"d":"€ 2,538.00"},null,{"$f":"IF(SELECTION!$C$46=\"Eur\",CODICI!D242,CODICI!D242*SELECTION!$C$48)","v":{"v":2538,"d":"€ 2,538.00"}}]
[238,"UE045XKC01",{"$f":"VLOOKUP(B243,LINGUA!$B:$H,2,0)","v":"humiSteam X-plus 45 kg/h, 230Vac 3~, with regulation, cleanable cylinder"},{"v":2606,"d":"€ 2,606.00"},null,{"$f":"IF(SELECTION!$C$46=\"Eur\",CODICI!D243,CODICI!D243*SELECTION!$C$48)","v":{"v":2606,"d":"€ 2,606.00"}}]
[239,"UE045XL001",{"$f":"VLOOKUP(B244,LINGUA!$B:$H,2,0)","v":"humiSteam X-plus 45 kg/h, 400Vac 3~, with regulation, disposable cylinder"},{"v":2538,"d":"€ 2,538.00"},null,{"$f":"IF(SELECTION!$C$46=\"Eur\",CODICI!D244,CODICI!D244*SELECTION!$C$48)","v":{"v":2538,"d":"€ 2,538.00"}}]
[240,"UE045XLC01",{"$f":"VLOOKUP(B245,LINGUA!$B:$H,2,0)","v":"humiSteam X-plus 45 kg/h, 400Vac 3~, with regulation, cleanable cylinder"},{"v":2606,"d":"€ 2,606.00"},null,{"$f":"IF(SELECTION!$C$46=\"Eur\",CODICI!D245,CODICI!D245*SELECTION!$C$48)","v":{"v":2606,"d":"€ 2,606.00"}}]
[241,"UE045XM001",{"$f":"VLOOKUP(B246,LINGUA!$B:$H,2,0)","v":"humiSteam X-plus 45 kg/h, 460Vac 3~, with regulation, disposable cylinder"},{"v":2538,"d":"€ 2,538.00"},null,{"$f":"IF(SELECTION!$C$46=\"Eur\",CODICI!D246,CODICI!D246*SELECTION!$C$48)","v":{"v":2538,"d":"€ 2,538.00"}}]
[242,"UE045XMC01",{"$f":"VLOOKUP(B247,LINGUA!$B:$H,2,0)","v":"humiSteam X-plus 45 kg/h, 460Vac 3~, with regulation, cleanable cylinder"},{"v":2606,"d":"€ 2,606.00"},null,{"$f":"IF(SELECTION!$C$46=\"Eur\",CODICI!D247,CODICI!D247*SELECTION!$C$48)","v":{"v":2606,"d":"€ 2,606.00"}}]
[243,"UE045XN001",{"$f":"VLOOKUP(B248,LINGUA!$B:$H,2,0)","v":"humiSteam X-plus 45 kg/h, 575Vac 3~, with regulation, disposable cylinder"},{"v":2538,"d":"€ 2,538.00"},null,{"$f":"IF(SELECTION!$C$46=\"Eur\",CODICI!D248,CODICI!D248*SELECTION!$C$48)","v":{"v":2538,"d":"€ 2,538.00"}}]
[244,"UE045XNC01",{"$f":"VLOOKUP(B249,LINGUA!$B:$H,2,0)","v":"humiSteam X-plus 45 kg/h, 575Vac 3~, with regulation, cleanable cylinder"},{"v":2606,"d":"€ 2,606.00"},null,{"$f":"IF(SELECTION!$C$46=\"Eur\",CODICI!D249,CODICI!D249*SELECTION!$C$48)","v":{"v":2606,"d":"€ 2,606.00"}}]
[245,"UE045XW001",{"$f":"VLOOKUP(B250,LINGUA!$B:$H,2,0)","v":"humiSteam X-plus 45 kg/h, 208Vac 3~, with regulation, disposable cylinder"},{"v":2538,"d":"€ 2,538.00"},null,{"$f":"IF(SELECTION!$C$46=\"Eur\",CODICI!D250,CODICI!D250*SELECTION!$C$48)","v":{"v":2538,"d":"€ 2,538.00"}}]
[246,"UE045XWC01",{"$f":"VLOOKUP(B251,LINGUA!$B:$H,2,0)","v":"humiSteam X-plus 45 kg/h, 208Vac 3~, with regulation, cleanable cylinder"},{"v":2606,"d":"€ 2,606.00"},null,{"$f":"IF(SELECTION!$C$46=\"Eur\",CODICI!D251,CODICI!D251*SELECTION!$C$48)","v":{"v":2606,"d":"€ 2,606.00"}}]
[247,"UE065XL001",{"$f":"VLOOKUP(B252,LINGUA!$B:$H,2,0)","v":"humiSteam X-plus 65 kg/h, 400Vac 3~, with regulation, disposable cylinder"},{"v":3069,"d":"€ 3,069.00"},null,{"$f":"IF(SELECTION!$C$46=\"Eur\",CODICI!D252,CODICI!D252*SELECTION!$C$48)","v":{"v":3069,"d":"€ 3,069.00"}}]
[248,"UE065XLC01",{"$f":"VLOOKUP(B253,LINGUA!$B:$H,2,0)","v":"humiSteam X-plus 65 kg/h, 400Vac 3~, with regulation, cleanable cylinder"},{"v":3215,"d":"€ 3,215.00"},null,{"$f":"IF(SELECTION!$C$46=\"Eur\",CODICI!D253,CODICI!D253*SELECTION!$C$48)","v":{"v":3215,"d":"€ 3,215.00"}}]
[249,"UE065XM001",{"$f":"VLOOKUP(B254,LINGUA!$B:$H,2,0)","v":"humiSteam X-plus 65 kg/h, 460Vac 3~, with regulation, disposable cylinder"},{"v":3069,"d":"€ 3,069.00"},null,{"$f":"IF(SELECTION!$C$46=\"Eur\",CODICI!D254,CODICI!D254*SELECTION!$C$48)","v":{"v":3069,"d":"€ 3,069.00"}}]
[250,"UE065XMC01",{"$f":"VLOOKUP(B255,LINGUA!$B:$H,2,0)","v":"humiSteam X-plus 65 kg/h, 460Vac 3~, with regulation, cleanable cylinder"},{"v":3215,"d":"€ 3,215.00"},null,{"$f":"IF(SELECTION!$C$46=\"Eur\",CODICI!D255,CODICI!D255*SELECTION!$C$48)","v":{"v":3215,"d":"€ 3,215.00"}}]
[251,"UE065XN001",{"$f":"VLOOKUP(B256,LINGUA!$B:$H,2,0)","v":"humiSteam X-plus 65 kg/h, 575Vac 3~, with regulation, disposable cylinder"},{"v":3069,"d":"€ 3,069.00"},null,{"$f":"IF(SELECTION!$C$46=\"Eur\",CODICI!D256,CODICI!D256*SELECTION!$C$48)","v":{"v":3069,"d":"€ 3,069.00"}}]
[252,"UE065XNC01",{"$f":"VLOOKUP(B257,LINGUA!$B:$H,2,0)","v":"humiSteam X-plus 65 kg/h, 575Vac 3~, with regulation, cleanable cylinder"},{"v":3215,"d":"€ 3,215.00"},null,{"$f":"IF(SELECTION!$C$46=\"Eur\",CODICI!D257,CODICI!D257*SELECTION!$C$48)","v":{"v":3215,"d":"€ 3,215.00"}}]
[253,"UE090XL001",{"$f":"VLOOKUP(B258,LINGUA!$B:$H,2,0)","v":"humiSteam X-plus 90 kg/h, 400Vac 3~, with regulation, disposable cylinder"},{"v":3880,"d":"€ 3,880.00"},null,{"$f":"IF(SELECTION!$C$46=\"Eur\",CODICI!D258,CODICI!D258*SELECTION!$C$48)","v":{"v":3880,"d":"€ 3,880.00"}}]
[254,"UE090XLC01",{"$f":"VLOOKUP(B259,LINGUA!$B:$H,2,0)","v":"humiSteam X-plus 90 kg/h, 400Vac 3~, with regulation, cleanable cylinder"},{"v":4058,"d":"€ 4,058.00"},null,{"$f":"IF(SELECTION!$C$46=\"Eur\",CODICI!D259,CODICI!D259*SELECTION!$C$48)","v":{"v":4058,"d":"€ 4,058.00"}}]
[255,"UE090XM001",{"$f":"VLOOKUP(B260,LINGUA!$B:$H,2,0)","v":"humiSteam X-plus 90 kg/h, 460Vac 3~, with regulation, disposable cylinder"},{"v":3880,"d":"€ 3,880.00"},null,{"$f":"IF(SELECTION!$C$46=\"Eur\",CODICI!D260,CODICI!D260*SELECTION!$C$48)","v":{"v":3880,"d":"€ 3,880.00"}}]
[256,"UE090XMC01",{"$f":"VLOOKUP(B261,LINGUA!$B:$H,2,0)","v":"humiSteam X-plus 90 kg/h, 460Vac 3~, with regulation, cleanable cylinder"},{"v":4058,"d":"€ 4,058.00"},null,{"$f":"IF(SELECTION!$C$46=\"Eur\",CODICI!D261,CODICI!D261*SELECTION!$C$48)","v":{"v":4058,"d":"€ 4,058.00"}}]
[257,"UE090XN001",{"$f":"VLOOKUP(B262,LINGUA!$B:$H,2,0)","v":"humiSteam X-plus 90 kg/h, 575Vac 3~, with regulation, disposable cylinder"},{"v":3880,"d":"€ 3,880.00"},null,{"$f":"IF(SELECTION!$C$46=\"Eur\",CODICI!D262,CODICI!D262*SELECTION!$C$48)","v":{"v":3880,"d":"€ 3,880.00"}}]
[258,"UE090XNC01",{"$f":"VLOOKUP(B263,LINGUA!$B:$H,2,0)","v":"humiSteam X-plus 90 kg/h, 575Vac 3~, with regulation, cleanable cylinder"},{"v":4058,"d":"€ 4,058.00"},null,{"$f":"IF(SELECTION!$C$46=\"Eur\",CODICI!D263,CODICI!D263*SELECTION!$C$48)","v":{"v":4058,"d":"€ 4,058.00"}}]
[{"$f":"+A263+1","v":259},"UE130XL001",{"$f":"VLOOKUP(B264,LINGUA!$B:$H,2,0)","v":"humiSteam X-plus 130 kg/h, 400Vac 3~, with regulation, disposable cylinder"},{"v":4360,"d":"€ 4,360.00"},null,{"$f":"IF(SELECTION!$C$46=\"Eur\",CODICI!D264,CODICI!D264*SELECTION!$C$48)","v":{"v":4360,"d":"€ 4,360.00"}}]
[260,"UE130XLC01",{"$f":"VLOOKUP(B265,LINGUA!$B:$H,2,0)","v":"humiSteam X-plus 130 kg/h, 400Vac 3~, with regulation, cleanable cylinder"},{"v":4625,"d":"€ 4,625.00"},null,{"$f":"IF(SELECTION!$C$46=\"Eur\",CODICI!D265,CODICI!D265*SELECTION!$C$48)","v":{"v":4625,"d":"€ 4,625.00"}}]
[261,"UE130XM001",{"$f":"VLOOKUP(B266,LINGUA!$B:$H,2,0)","v":"humiSteam X-plus 130 kg/h, 460Vac 3~, with regulation, disposable cylinder"},{"v":4361,"d":"€ 4,361.00"},null,{"$f":"IF(SELECTION!$C$46=\"Eur\",CODICI!D266,CODICI!D266*SELECTION!$C$48)","v":{"v":4361,"d":"€ 4,361.00"}}]
[262,"UE130XMC01",{"$f":"VLOOKUP(B267,LINGUA!$B:$H,2,0)","v":"humiSteam X-plus 130 kg/h, 460Vac 3~, with regulation, cleanable cylinder"},{"v":4625,"d":"€ 4,625.00"},null,{"$f":"IF(SELECTION!$C$46=\"Eur\",CODICI!D267,CODICI!D267*SELECTION!$C$48)","v":{"v":4625,"d":"€ 4,625.00"}}]
[263,"UE130XN001",{"$f":"VLOOKUP(B268,LINGUA!$B:$H,2,0)","v":"humiSteam X-plus 130 kg/h, 575Vac 3~, with regulation, disposable cylinder"},{"v":4360,"d":"€ 4,360.00"},null,{"$f":"IF(SELECTION!$C$46=\"Eur\",CODICI!D268,CODICI!D268*SELECTION!$C$48)","v":{"v":4360,"d":"€ 4,360.00"}}]
[264,"UE130XNC01",{"$f":"VLOOKUP(B269,LINGUA!$B:$H,2,0)","v":"humiSteam X-plus 130 kg/h, 575Vac 3~, with regulation, cleanable cylinder"},{"v":4360,"d":"€ 4,360.00"},null,{"$f":"IF(SELECTION!$C$46=\"Eur\",CODICI!D269,CODICI!D269*SELECTION!$C$48)","v":{"v":4360,"d":"€ 4,360.00"}}]
[265,"UR002CD002",{"$f":"VLOOKUP(B270,LINGUA!$B:$H,2,0)","v":"heaterSteam 2 kg/h , 230Vac 1~, ON/OFF or proportional, basic version"},{"$error":"#N/A"},null,{"$f":"IF(SELECTION!$C$46=\"Eur\",CODICI!D270,CODICI!D270*SELECTION!$C$48)","v":{"$error":"#N/A"}}]
[266,"UR002CD102",{"$f":"VLOOKUP(B271,LINGUA!$B:$H,2,0)","v":"heaterSteam 2 kg/h , 230Vac 1~, ON/OFF or proportional, full optional version"},{"$error":"#N/A"},null,{"$f":"IF(SELECTION!$C$46=\"Eur\",CODICI!D271,CODICI!D271*SELECTION!$C$48)","v":{"$error":"#N/A"}}]
[267,"UR002CU002",{"$f":"VLOOKUP(B272,LINGUA!$B:$H,2,0)","v":"heaterSteam 2 kg/h , 208Vac 1~, ON/OFF or proportional, basic version"},{"$error":"#N/A"},null,{"$f":"IF(SELECTION!$C$46=\"Eur\",CODICI!D272,CODICI!D272*SELECTION!$C$48)","v":{"$error":"#N/A"}}]
[268,"UR002CU102",{"$f":"VLOOKUP(B273,LINGUA!$B:$H,2,0)","v":"heaterSteam 2 kg/h , 208Vac 1~, ON/OFF or proportional, full optional version"},{"$error":"#N/A"},null,{"$f":"IF(SELECTION!$C$46=\"Eur\",CODICI!D273,CODICI!D273*SELECTION!$C$48)","v":{"$error":"#N/A"}}]
[269,"UR002HD003",{"$f":"VLOOKUP(B274,LINGUA!$B:$H,2,0)","v":"heaterSteam process, 2 kg/h , 230Vac 1~, with regulation"},{"v":1547,"d":"€ 1,547.00"},null,{"$f":"IF(SELECTION!$C$46=\"Eur\",CODICI!D274,CODICI!D274*SELECTION!$C$48)","v":{"v":1547,"d":"€ 1,547.00"}}]
[270,"UR002HD103",{"$f":"VLOOKUP(B275,LINGUA!$B:$H,2,0)","v":"heaterSteam 2 kg/h , 230Vac 1~, with regulation, Titanium version"},{"v":1705,"d":"€ 1,705.00"},null,{"$f":"IF(SELECTION!$C$46=\"Eur\",CODICI!D275,CODICI!D275*SELECTION!$C$48)","v":{"v":1705,"d":"€ 1,705.00"}}]
[271,"UR002HU002",{"$f":"VLOOKUP(B276,LINGUA!$B:$H,2,0)","v":"heaterSteam 2 kg/h , 208Vac 1~, with regulation, basic version"},{"v":1547,"d":"€ 1,547.00"},null,{"$f":"IF(SELECTION!$C$46=\"Eur\",CODICI!D276,CODICI!D276*SELECTION!$C$48)","v":{"v":1547,"d":"€ 1,547.00"}}]
[272,"UR002HU102",{"$f":"VLOOKUP(B277,LINGUA!$B:$H,2,0)","v":"heaterSteam 2 kg/h , 208Vac 1~, with regulation, full optional version"},{"v":1655,"d":"€ 1,655.00"},null,{"$f":"IF(SELECTION!$C$46=\"Eur\",CODICI!D277,CODICI!D277*SELECTION!$C$48)","v":{"v":1655,"d":"€ 1,655.00"}}]
[273,"UR004CD002",{"$f":"VLOOKUP(B278,LINGUA!$B:$H,2,0)","v":"heaterSteam 4 kg/h , 230Vac 1~, ON/OFF or proportional, basic version"},{"$error":"#N/A"},null,{"$f":"IF(SELECTION!$C$46=\"Eur\",CODICI!D278,CODICI!D278*SELECTION!$C$48)","v":{"$error":"#N/A"}}]
[274,"UR004CD102",{"$f":"VLOOKUP(B279,LINGUA!$B:$H,2,0)","v":"heaterSteam 4 kg/h , 230Vac 1~, ON/OFF or proportional, full optional version"},{"$error":"#N/A"},null,{"$f":"IF(SELECTION!$C$46=\"Eur\",CODICI!D279,CODICI!D279*SELECTION!$C$48)","v":{"$error":"#N/A"}}]
[275,"UR004CU002",{"$f":"VLOOKUP(B280,LINGUA!$B:$H,2,0)","v":"heaterSteam 4 kg/h , 208Vac 1~, ON/OFF or proportional, basic version"},{"$error":"#N/A"},null,{"$f":"IF(SELECTION!$C$46=\"Eur\",CODICI!D280,CODICI!D280*SELECTION!$C$48)","v":{"$error":"#N/A"}}]
[276,"UR004CU102",{"$f":"VLOOKUP(B281,LINGUA!$B:$H,2,0)","v":"heaterSteam 4 kg/h , 208Vac 1~, ON/OFF or proportional, full optional version"},{"$error":"#N/A"},null,{"$f":"IF(SELECTION!$C$46=\"Eur\",CODICI!D281,CODICI!D281*SELECTION!$C$48)","v":{"$error":"#N/A"}}]
[277,"UR004HD003",{"$f":"VLOOKUP(B282,LINGUA!$B:$H,2,0)","v":"heaterSteam process, 4 kg/h , 230Vac 1~, with regulation"},{"v":1655,"d":"€ 1,655.00"},null,{"$f":"IF(SELECTION!$C$46=\"Eur\",CODICI!D282,CODICI!D282*SELECTION!$C$48)","v":{"v":1655,"d":"€ 1,655.00"}}]
[278,"UR004HD103",{"$f":"VLOOKUP(B283,LINGUA!$B:$H,2,0)","v":"heaterSteam 4 kg/h , 230Vac 1~, with regulation, Titanium version"},{"v":1817,"d":"€ 1,817.00"},null,{"$f":"IF(SELECTION!$C$46=\"Eur\",CODICI!D283,CODICI!D283*SELECTION!$C$48)","v":{"v":1817,"d":"€ 1,817.00"}}]
[279,"UR004HU002",{"$f":"VLOOKUP(B284,LINGUA!$B:$H,2,0)","v":"heaterSteam 4 kg/h , 208Vac 1~, with regulation, basic version"},{"v":1655,"d":"€ 1,655.00"},null,{"$f":"IF(SELECTION!$C$46=\"Eur\",CODICI!D284,CODICI!D284*SELECTION!$C$48)","v":{"v":1655,"d":"€ 1,655.00"}}]
[280,"UR004HU102",{"$f":"VLOOKUP(B285,LINGUA!$B:$H,2,0)","v":"heaterSteam 4 kg/h , 208Vac 1~, with regulation, full optional version"},{"v":1764,"d":"€ 1,764.00"},null,{"$f":"IF(SELECTION!$C$46=\"Eur\",CODICI!D285,CODICI!D285*SELECTION!$C$48)","v":{"v":1764,"d":"€ 1,764.00"}}]
[281,"UR006CD002",{"$f":"VLOOKUP(B286,LINGUA!$B:$H,2,0)","v":"heaterSteam 6 kg/h , 230Vac 1~, ON/OFF or proportional, basic version"},{"$error":"#N/A"},null,{"$f":"IF(SELECTION!$C$46=\"Eur\",CODICI!D286,CODICI!D286*SELECTION!$C$48)","v":{"$error":"#N/A"}}]
[282,"UR006CD102",{"$f":"VLOOKUP(B287,LINGUA!$B:$H,2,0)","v":"heaterSteam 6 kg/h , 230Vac 1~, ON/OFF or proportional, full optional version"},{"$error":"#N/A"},null,{"$f":"IF(SELECTION!$C$46=\"Eur\",CODICI!D287,CODICI!D287*SELECTION!$C$48)","v":{"$error":"#N/A"}}]
[283,"UR006CK002",{"$f":"VLOOKUP(B288,LINGUA!$B:$H,2,0)","v":"heaterSteam 6 kg/h , 230Vac 3~, ON/OFF or proportional, basic version"},{"$error":"#N/A"},null,{"$f":"IF(SELECTION!$C$46=\"Eur\",CODICI!D288,CODICI!D288*SELECTION!$C$48)","v":{"$error":"#N/A"}}]
[284,"UR006CK102",{"$f":"VLOOKUP(B289,LINGUA!$B:$H,2,0)","v":"heaterSteam 6 kg/h , 230Vac 3~, ON/OFF or proportional, full optional version"},{"$error":"#N/A"},null,{"$f":"IF(SELECTION!$C$46=\"Eur\",CODICI!D289,CODICI!D289*SELECTION!$C$48)","v":{"$error":"#N/A"}}]
[285,"UR006CL002",{"$f":"VLOOKUP(B290,LINGUA!$B:$H,2,0)","v":"heaterSteam 6 kg/h , 400Vac 3~, ON/OFF or proportional, basic version"},{"$error":"#N/A"},null,{"$f":"IF(SELECTION!$C$46=\"Eur\",CODICI!D290,CODICI!D290*SELECTION!$C$48)","v":{"$error":"#N/A"}}]
[286,"UR006CL102",{"$f":"VLOOKUP(B291,LINGUA!$B:$H,2,0)","v":"heaterSteam 6 kg/h , 400Vac 3~, ON/OFF or proportional, full optional version"},{"$error":"#N/A"},null,{"$f":"IF(SELECTION!$C$46=\"Eur\",CODICI!D291,CODICI!D291*SELECTION!$C$48)","v":{"$error":"#N/A"}}]
[287,"UR006CM002",{"$f":"VLOOKUP(B292,LINGUA!$B:$H,2,0)","v":"heaterSteam 6 kg/h , 460Vac 3~, ON/OFF or proportional, basic version"},{"$error":"#N/A"},null,{"$f":"IF(SELECTION!$C$46=\"Eur\",CODICI!D292,CODICI!D292*SELECTION!$C$48)","v":{"$error":"#N/A"}}]
[288,"UR006CM102",{"$f":"VLOOKUP(B293,LINGUA!$B:$H,2,0)","v":"heaterSteam 6 kg/h , 460Vac 3~, ON/OFF or proportional, full optional version"},{"$error":"#N/A"},null,{"$f":"IF(SELECTION!$C$46=\"Eur\",CODICI!D293,CODICI!D293*SELECTION!$C$48)","v":{"$error":"#N/A"}}]
[289,"UR006CN002",{"$f":"VLOOKUP(B294,LINGUA!$B:$H,2,0)","v":"heaterSteam 6 kg/h , 575Vac 3~, ON/OFF or proportional, basic version"},{"$error":"#N/A"},null,{"$f":"IF(SELECTION!$C$46=\"Eur\",CODICI!D294,CODICI!D294*SELECTION!$C$48)","v":{"$error":"#N/A"}}]
[290,"UR006CN102",{"$f":"VLOOKUP(B295,LINGUA!$B:$H,2,0)","v":"heaterSteam 6 kg/h , 575Vac 3~, ON/OFF or proportional, full optional version"},{"$error":"#N/A"},null,{"$f":"IF(SELECTION!$C$46=\"Eur\",CODICI!D295,CODICI!D295*SELECTION!$C$48)","v":{"$error":"#N/A"}}]
[291,"UR006CU002",{"$f":"VLOOKUP(B296,LINGUA!$B:$H,2,0)","v":"heaterSteam 6 kg/h , 208Vac 1~, ON/OFF or proportional, basic version"},{"$error":"#N/A"},null,{"$f":"IF(SELECTION!$C$46=\"Eur\",CODICI!D296,CODICI!D296*SELECTION!$C$48)","v":{"$error":"#N/A"}}]
[292,"UR006CU102",{"$f":"VLOOKUP(B297,LINGUA!$B:$H,2,0)","v":"heaterSteam 6 kg/h , 208Vac 1~, ON/OFF or proportional, full optional version"},{"$error":"#N/A"},null,{"$f":"IF(SELECTION!$C$46=\"Eur\",CODICI!D297,CODICI!D297*SELECTION!$C$48)","v":{"$error":"#N/A"}}]
[293,"UR006CW002",{"$f":"VLOOKUP(B298,LINGUA!$B:$H,2,0)","v":"heaterSteam 6 kg/h , 208Vac 3~, ON/OFF or proportional, basic version"},{"$error":"#N/A"},null,{"$f":"IF(SELECTION!$C$46=\"Eur\",CODICI!D298,CODICI!D298*SELECTION!$C$48)","v":{"$error":"#N/A"}}]
[294,"UR006CW102",{"$f":"VLOOKUP(B299,LINGUA!$B:$H,2,0)","v":"heaterSteam 6 kg/h , 208Vac 3~, ON/OFF or proportional, full optional version"},{"$error":"#N/A"},null,{"$f":"IF(SELECTION!$C$46=\"Eur\",CODICI!D299,CODICI!D299*SELECTION!$C$48)","v":{"$error":"#N/A"}}]
[295,"UR006HD003",{"$f":"VLOOKUP(B300,LINGUA!$B:$H,2,0)","v":"heaterSteam process, 6 kg/h , 230Vac 1~, with regulationn"},{"v":2226,"d":"€ 2,226.00"},null,{"$f":"IF(SELECTION!$C$46=\"Eur\",CODICI!D300,CODICI!D300*SELECTION!$C$48)","v":{"v":2226,"d":"€ 2,226.00"}}]
[296,"UR006HD103",{"$f":"VLOOKUP(B301,LINGUA!$B:$H,2,0)","v":"heaterSteam 6 kg/h , 230Vac 1~, with regulation, Titanium version"},{"v":2516,"d":"€ 2,516.00"},null,{"$f":"IF(SELECTION!$C$46=\"Eur\",CODICI!D301,CODICI!D301*SELECTION!$C$48)","v":{"v":2516,"d":"€ 2,516.00"}}]
[297,"UR006HK003",{"$f":"VLOOKUP(B302,LINGUA!$B:$H,2,0)","v":"heaterSteam process, 6 kg/h , 230Vac 3~, with regulation"},{"v":2226,"d":"€ 2,226.00"},null,{"$f":"IF(SELECTION!$C$46=\"Eur\",CODICI!D302,CODICI!D302*SELECTION!$C$48)","v":{"v":2226,"d":"€ 2,226.00"}}]
[298,"UR006HK103",{"$f":"VLOOKUP(B303,LINGUA!$B:$H,2,0)","v":"heaterSteam 6 kg/h , 230Vac 3~, with regulation, Titanium version"},{"v":2516,"d":"€ 2,516.00"},null,{"$f":"IF(SELECTION!$C$46=\"Eur\",CODICI!D303,CODICI!D303*SELECTION!$C$48)","v":{"v":2516,"d":"€ 2,516.00"}}]
[299,"UR006HL003",{"$f":"VLOOKUP(B304,LINGUA!$B:$H,2,0)","v":"heaterSteam process, 6 kg/h , 400Vac 3~, with regulation"},{"v":2226,"d":"€ 2,226.00"},null,{"$f":"IF(SELECTION!$C$46=\"Eur\",CODICI!D304,CODICI!D304*SELECTION!$C$48)","v":{"v":2226,"d":"€ 2,226.00"}}]
[300,"UR006HL103",{"$f":"VLOOKUP(B305,LINGUA!$B:$H,2,0)","v":"heaterSteam 6 kg/h , 400Vac 3~, with regulation, Titanium version"},{"v":2516,"d":"€ 2,516.00"},null,{"$f":"IF(SELECTION!$C$46=\"Eur\",CODICI!D305,CODICI!D305*SELECTION!$C$48)","v":{"v":2516,"d":"€ 2,516.00"}}]
[301,"UR006HM002",{"$f":"VLOOKUP(B306,LINGUA!$B:$H,2,0)","v":{"$error":"#N/A"}},{"v":2226,"d":"€ 2,226.00"},null,{"$f":"IF(SELECTION!$C$46=\"Eur\",CODICI!D306,CODICI!D306*SELECTION!$C$48)","v":{"v":2226,"d":"€ 2,226.00"}}]
[302,"UR006HM102",{"$f":"VLOOKUP(B307,LINGUA!$B:$H,2,0)","v":{"$error":"#N/A"}},{"v":2442,"d":"€ 2,442.00"},null,{"$f":"IF(SELECTION!$C$46=\"Eur\",CODICI!D307,CODICI!D307*SELECTION!$C$48)","v":{"v":2442,"d":"€ 2,442.00"}}]
[303,"UR006HN002",{"$f":"VLOOKUP(B308,LINGUA!$B:$H,2,0)","v":"heaterSteam 6 kg/h , 575Vac 3~, with regulation, basic version"},{"v":2226,"d":"€ 2,226.00"},null,{"$f":"IF(SELECTION!$C$46=\"Eur\",CODICI!D308,CODICI!D308*SELECTION!$C$48)","v":{"v":2226,"d":"€ 2,226.00"}}]
[304,"UR006HN102",{"$f":"VLOOKUP(B309,LINGUA!$B:$H,2,0)","v":"heaterSteam 6 kg/h , 575Vac 3~, with regulation, full optional version"},{"v":2442,"d":"€ 2,442.00"},null,{"$f":"IF(SELECTION!$C$46=\"Eur\",CODICI!D309,CODICI!D309*SELECTION!$C$48)","v":{"v":2442,"d":"€ 2,442.00"}}]
[305,"UR006HU002",{"$f":"VLOOKUP(B310,LINGUA!$B:$H,2,0)","v":"heaterSteam 6 kg/h , 208Vac 1~, with regulation, basic version"},{"v":2226,"d":"€ 2,226.00"},null,{"$f":"IF(SELECTION!$C$46=\"Eur\",CODICI!D310,CODICI!D310*SELECTION!$C$48)","v":{"v":2226,"d":"€ 2,226.00"}}]
[306,"UR006HU102",{"$f":"VLOOKUP(B311,LINGUA!$B:$H,2,0)","v":"heaterSteam 6 kg/h , 208Vac 1~, with regulation, full optional version"},{"v":2442,"d":"€ 2,442.00"},null,{"$f":"IF(SELECTION!$C$46=\"Eur\",CODICI!D311,CODICI!D311*SELECTION!$C$48)","v":{"v":2442,"d":"€ 2,442.00"}}]
[307,"UR006HW002",{"$f":"VLOOKUP(B312,LINGUA!$B:$H,2,0)","v":"heaterSteam 6 kg/h , 208Vac 3~, with regulation, basic version"},{"v":2226,"d":"€ 2,226.00"},null,{"$f":"IF(SELECTION!$C$46=\"Eur\",CODICI!D312,CODICI!D312*SELECTION!$C$48)","v":{"v":2226,"d":"€ 2,226.00"}}]
[308,"UR006HW102",{"$f":"VLOOKUP(B313,LINGUA!$B:$H,2,0)","v":"heaterSteam 6 kg/h , 208Vac 3~, with regulation, full optional version"},{"v":2442,"d":"€ 2,442.00"},null,{"$f":"IF(SELECTION!$C$46=\"Eur\",CODICI!D313,CODICI!D313*SELECTION!$C$48)","v":{"v":2442,"d":"€ 2,442.00"}}]
[309,"UR010CK002",{"$f":"VLOOKUP(B314,LINGUA!$B:$H,2,0)","v":"heaterSteam 10 kg/h , 230Vac 3~, ON/OFF or proportional, basic version"},{"$error":"#N/A"},null,{"$f":"IF(SELECTION!$C$46=\"Eur\",CODICI!D314,CODICI!D314*SELECTION!$C$48)","v":{"$error":"#N/A"}}]
[310,"UR010CK102",{"$f":"VLOOKUP(B315,LINGUA!$B:$H,2,0)","v":"heaterSteam 10 kg/h , 230Vac 3~, ON/OFF or proportional, full optional version"},{"$error":"#N/A"},null,{"$f":"IF(SELECTION!$C$46=\"Eur\",CODICI!D315,CODICI!D315*SELECTION!$C$48)","v":{"$error":"#N/A"}}]
[311,"UR010CL002",{"$f":"VLOOKUP(B316,LINGUA!$B:$H,2,0)","v":"heaterSteam 10 kg/h , 400Vac 3~, ON/OFF or proportional, basic version"},{"$error":"#N/A"},null,{"$f":"IF(SELECTION!$C$46=\"Eur\",CODICI!D316,CODICI!D316*SELECTION!$C$48)","v":{"$error":"#N/A"}}]
[312,"UR010CL102",{"$f":"VLOOKUP(B317,LINGUA!$B:$H,2,0)","v":"heaterSteam 10 kg/h , 400Vac 3~, ON/OFF or proportional, full optional version"},{"$error":"#N/A"},null,{"$f":"IF(SELECTION!$C$46=\"Eur\",CODICI!D317,CODICI!D317*SELECTION!$C$48)","v":{"$error":"#N/A"}}]
[313,"UR010CM002",{"$f":"VLOOKUP(B318,LINGUA!$B:$H,2,0)","v":"heaterSteam 10 kg/h , 460Vac 3~, ON/OFF or proportional, basic version"},{"$error":"#N/A"},null,{"$f":"IF(SELECTION!$C$46=\"Eur\",CODICI!D318,CODICI!D318*SELECTION!$C$48)","v":{"$error":"#N/A"}}]
[314,"UR010CM102",{"$f":"VLOOKUP(B319,LINGUA!$B:$H,2,0)","v":"heaterSteam 10 kg/h , 460Vac 3~, ON/OFF or proportional, full optional version"},{"$error":"#N/A"},null,{"$f":"IF(SELECTION!$C$46=\"Eur\",CODICI!D319,CODICI!D319*SELECTION!$C$48)","v":{"$error":"#N/A"}}]
[315,"UR010CN002",{"$f":"VLOOKUP(B320,LINGUA!$B:$H,2,0)","v":"heaterSteam 10 kg/h , 575Vac 3~, ON/OFF or proportional, basic version"},{"$error":"#N/A"},null,{"$f":"IF(SELECTION!$C$46=\"Eur\",CODICI!D320,CODICI!D320*SELECTION!$C$48)","v":{"$error":"#N/A"}}]
[316,"UR010CN102",{"$f":"VLOOKUP(B321,LINGUA!$B:$H,2,0)","v":"heaterSteam 10 kg/h , 575Vac 3~, ON/OFF or proportional, full optional version"},{"$error":"#N/A"},null,{"$f":"IF(SELECTION!$C$46=\"Eur\",CODICI!D321,CODICI!D321*SELECTION!$C$48)","v":{"$error":"#N/A"}}]
[317,"UR010CW002",{"$f":"VLOOKUP(B322,LINGUA!$B:$H,2,0)","v":"heaterSteam 10 kg/h , 208Vac 3~, ON/OFF or proportional, basic version"},{"$error":"#N/A"},null,{"$f":"IF(SELECTION!$C$46=\"Eur\",CODICI!D322,CODICI!D322*SELECTION!$C$48)","v":{"$error":"#N/A"}}]
[318,"UR010CW102",{"$f":"VLOOKUP(B323,LINGUA!$B:$H,2,0)","v":"heaterSteam 10 kg/h , 208Vac 3~, ON/OFF or proportional, full optional version"},{"$error":"#N/A"},null,{"$f":"IF(SELECTION!$C$46=\"Eur\",CODICI!D323,CODICI!D323*SELECTION!$C$48)","v":{"$error":"#N/A"}}]
[319,"UR010HK003",{"$f":"VLOOKUP(B324,LINGUA!$B:$H,2,0)","v":"heaterSteam process, 10 kg/h , 230Vac 3~, with regulation"},{"v":2442,"d":"€ 2,442.00"},null,{"$f":"IF(SELECTION!$C$46=\"Eur\",CODICI!D324,CODICI!D324*SELECTION!$C$48)","v":{"v":2442,"d":"€ 2,442.00"}}]
[320,"UR010HK103",{"$f":"VLOOKUP(B325,LINGUA!$B:$H,2,0)","v":"heaterSteam 10 kg/h , 230Vac 3~, with regulation, Titanium version"},{"v":2740,"d":"€ 2,740.00"},null,{"$f":"IF(SELECTION!$C$46=\"Eur\",CODICI!D325,CODICI!D325*SELECTION!$C$48)","v":{"v":2740,"d":"€ 2,740.00"}}]
[321,"UR010HL003",{"$f":"VLOOKUP(B326,LINGUA!$B:$H,2,0)","v":"heaterSteam process, 10 kg/h , 400Vac 3~, with regulation"},{"v":2442,"d":"€ 2,442.00"},null,{"$f":"IF(SELECTION!$C$46=\"Eur\",CODICI!D326,CODICI!D326*SELECTION!$C$48)","v":{"v":2442,"d":"€ 2,442.00"}}]
[322,"UR010HL103",{"$f":"VLOOKUP(B327,LINGUA!$B:$H,2,0)","v":"heaterSteam 10 kg/h , 400Vac 3~, with regulation, Titanium version"},{"v":2740,"d":"€ 2,740.00"},null,{"$f":"IF(SELECTION!$C$46=\"Eur\",CODICI!D327,CODICI!D327*SELECTION!$C$48)","v":{"v":2740,"d":"€ 2,740.00"}}]
[{"$f":"+A327+1","v":323},"UR010HM003",{"$f":"VLOOKUP(B328,LINGUA!$B:$H,2,0)","v":"heaterSteam process, 10 kg/h , 460Vac 3~, with regulation"},{"v":2467,"d":"€ 2,467.00"},null,{"$f":"IF(SELECTION!$C$46=\"Eur\",CODICI!D328,CODICI!D328*SELECTION!$C$48)","v":{"v":2467,"d":"€ 2,467.00"}}]
[324,"UR010HM103",{"$f":"VLOOKUP(B329,LINGUA!$B:$H,2,0)","v":"heaterSteam 10 kg/h , 460Vac 3~, with regulation, Titanium version"},{"v":2767,"d":"€ 2,767.00"},null,{"$f":"IF(SELECTION!$C$46=\"Eur\",CODICI!D329,CODICI!D329*SELECTION!$C$48)","v":{"v":2767,"d":"€ 2,767.00"}}]
[325,"UR010HN002",{"$f":"VLOOKUP(B330,LINGUA!$B:$H,2,0)","v":"heaterSteam 10 kg/h , 575Vac 3~, with regulation, basic version"},{"v":2442,"d":"€ 2,442.00"},null,{"$f":"IF(SELECTION!$C$46=\"Eur\",CODICI!D330,CODICI!D330*SELECTION!$C$48)","v":{"v":2442,"d":"€ 2,442.00"}}]
[326,"UR010HN102",{"$f":"VLOOKUP(B331,LINGUA!$B:$H,2,0)","v":"heaterSteam 10 kg/h , 575Vac 3~, with regulation, full optional version"},{"v":2660,"d":"€ 2,660.00"},null,{"$f":"IF(SELECTION!$C$46=\"Eur\",CODICI!D331,CODICI!D331*SELECTION!$C$48)","v":{"v":2660,"d":"€ 2,660.00"}}]
[327,"UR010HW002",{"$f":"VLOOKUP(B332,LINGUA!$B:$H,2,0)","v":"heaterSteam 10 kg/h , 208Vac 3~, with regulation, basic version"},{"v":2442,"d":"€ 2,442.00"},null,{"$f":"IF(SELECTION!$C$46=\"Eur\",CODICI!D332,CODICI!D332*SELECTION!$C$48)","v":{"v":2442,"d":"€ 2,442.00"}}]
[328,"UR010HW102",{"$f":"VLOOKUP(B333,LINGUA!$B:$H,2,0)","v":"heaterSteam 10 kg/h , 208Vac 3~, with regulation, full optional version"},{"v":2660,"d":"€ 2,660.00"},null,{"$f":"IF(SELECTION!$C$46=\"Eur\",CODICI!D333,CODICI!D333*SELECTION!$C$48)","v":{"v":2660,"d":"€ 2,660.00"}}]
[329,"UR013HW002",{"$f":"VLOOKUP(B334,LINGUA!$B:$H,2,0)","v":"heaterSteam 13 kg/h , 208Vac 3~, with regulation, basic version"},{"v":2714,"d":"€ 2,714.00"},null,{"$f":"IF(SELECTION!$C$46=\"Eur\",CODICI!D334,CODICI!D334*SELECTION!$C$48)","v":{"v":2714,"d":"€ 2,714.00"}}]
[330,"UR013HW102",{"$f":"VLOOKUP(B335,LINGUA!$B:$H,2,0)","v":"heaterSteam 13 kg/h , 208Vac 3~, with regulation, full optional version"},{"v":2890,"d":"€ 2,890.00"},null,{"$f":"IF(SELECTION!$C$46=\"Eur\",CODICI!D335,CODICI!D335*SELECTION!$C$48)","v":{"v":2890,"d":"€ 2,890.00"}}]
[331,"UR013HK003",{"$f":"VLOOKUP(B336,LINGUA!$B:$H,2,0)","v":"heaterSteam process, 13 kg/h , 230Vac 3~, with regulation"},{"v":2714,"d":"€ 2,714.00"},null,{"$f":"IF(SELECTION!$C$46=\"Eur\",CODICI!D336,CODICI!D336*SELECTION!$C$48)","v":{"v":2714,"d":"€ 2,714.00"}}]
[332,"UR013HK103",{"$f":"VLOOKUP(B337,LINGUA!$B:$H,2,0)","v":"heaterSteam 13 kg/h , 230Vac 3~, with regulation, Titanium version"},{"v":2978,"d":"€ 2,978.00"},null,{"$f":"IF(SELECTION!$C$46=\"Eur\",CODICI!D337,CODICI!D337*SELECTION!$C$48)","v":{"v":2978,"d":"€ 2,978.00"}}]
[333,"UR013HL003",{"$f":"VLOOKUP(B338,LINGUA!$B:$H,2,0)","v":"heaterSteam process, 13 kg/h , 400Vac 3~, with regulation"},{"v":2714,"d":"€ 2,714.00"},null,{"$f":"IF(SELECTION!$C$46=\"Eur\",CODICI!D338,CODICI!D338*SELECTION!$C$48)","v":{"v":2714,"d":"€ 2,714.00"}}]
[334,"UR013HL103",{"$f":"VLOOKUP(B339,LINGUA!$B:$H,2,0)","v":"heaterSteam 13 kg/h , 400Vac 3~, with regulation, Titanium version"},{"v":2978,"d":"€ 2,978.00"},null,{"$f":"IF(SELECTION!$C$46=\"Eur\",CODICI!D339,CODICI!D339*SELECTION!$C$48)","v":{"v":2978,"d":"€ 2,978.00"}}]
[335,"UR013HM003",{"$f":"VLOOKUP(B340,LINGUA!$B:$H,2,0)","v":"heaterSteam process, 13 kg/h , 460Vac 3~, with regulation"},{"v":2742,"d":"€ 2,742.00"},null,{"$f":"IF(SELECTION!$C$46=\"Eur\",CODICI!D340,CODICI!D340*SELECTION!$C$48)","v":{"v":2742,"d":"€ 2,742.00"}}]
[336,"UR013HM103",{"$f":"VLOOKUP(B341,LINGUA!$B:$H,2,0)","v":"heaterSteam 13 kg/h , 460Vac 3~, with regulation, Titanium version"},{"v":3008,"d":"€ 3,008.00"},null,{"$f":"IF(SELECTION!$C$46=\"Eur\",CODICI!D341,CODICI!D341*SELECTION!$C$48)","v":{"v":3008,"d":"€ 3,008.00"}}]
[337,"UR013HN002",{"$f":"VLOOKUP(B342,LINGUA!$B:$H,2,0)","v":"heaterSteam 13 kg/h , 575Vac 3~, with regulation, basic version"},{"v":2714,"d":"€ 2,714.00"},null,{"$f":"IF(SELECTION!$C$46=\"Eur\",CODICI!D342,CODICI!D342*SELECTION!$C$48)","v":{"v":2714,"d":"€ 2,714.00"}}]
[338,"UR013HN102",{"$f":"VLOOKUP(B343,LINGUA!$B:$H,2,0)","v":"heaterSteam 13 kg/h , 575Vac 3~, with regulation, full optional version"},{"v":2890,"d":"€ 2,890.00"},null,{"$f":"IF(SELECTION!$C$46=\"Eur\",CODICI!D343,CODICI!D343*SELECTION!$C$48)","v":{"v":2890,"d":"€ 2,890.00"}}]
[339,"UR020CK002",{"$f":"VLOOKUP(B344,LINGUA!$B:$H,2,0)","v":"heaterSteam 20 kg/h , 230Vac 3~, ON/OFF or proportional, basic version"},{"$error":"#N/A"},null,{"$f":"IF(SELECTION!$C$46=\"Eur\",CODICI!D344,CODICI!D344*SELECTION!$C$48)","v":{"$error":"#N/A"}}]
[340,"UR020CK102",{"$f":"VLOOKUP(B345,LINGUA!$B:$H,2,0)","v":"heaterSteam 20 kg/h , 230Vac 3~, ON/OFF or proportional, full optional version"},{"$error":"#N/A"},null,{"$f":"IF(SELECTION!$C$46=\"Eur\",CODICI!D345,CODICI!D345*SELECTION!$C$48)","v":{"$error":"#N/A"}}]
[341,"UR020CL002",{"$f":"VLOOKUP(B346,LINGUA!$B:$H,2,0)","v":"heaterSteam 20 kg/h , 400Vac 3~, ON/OFF or proportional, basic version"},{"$error":"#N/A"},null,{"$f":"IF(SELECTION!$C$46=\"Eur\",CODICI!D346,CODICI!D346*SELECTION!$C$48)","v":{"$error":"#N/A"}}]
[342,"UR020CL102",{"$f":"VLOOKUP(B347,LINGUA!$B:$H,2,0)","v":"heaterSteam 20 kg/h , 400Vac 3~, ON/OFF or proportional, full optional version"},{"$error":"#N/A"},null,{"$f":"IF(SELECTION!$C$46=\"Eur\",CODICI!D347,CODICI!D347*SELECTION!$C$48)","v":{"$error":"#N/A"}}]
[343,"UR020CM002",{"$f":"VLOOKUP(B348,LINGUA!$B:$H,2,0)","v":"heaterSteam 20 kg/h , 460Vac 3~, ON/OFF or proportional, basic version"},{"$error":"#N/A"},null,{"$f":"IF(SELECTION!$C$46=\"Eur\",CODICI!D348,CODICI!D348*SELECTION!$C$48)","v":{"$error":"#N/A"}}]
[344,"UR020CM102",{"$f":"VLOOKUP(B349,LINGUA!$B:$H,2,0)","v":"heaterSteam 20 kg/h , 460Vac 3~, ON/OFF or proportional, full optional version"},{"$error":"#N/A"},null,{"$f":"IF(SELECTION!$C$46=\"Eur\",CODICI!D349,CODICI!D349*SELECTION!$C$48)","v":{"$error":"#N/A"}}]
[345,"UR020CN002",{"$f":"VLOOKUP(B350,LINGUA!$B:$H,2,0)","v":"heaterSteam 20 kg/h , 575Vac 3~, ON/OFF or proportional, basic version"},{"$error":"#N/A"},null,{"$f":"IF(SELECTION!$C$46=\"Eur\",CODICI!D350,CODICI!D350*SELECTION!$C$48)","v":{"$error":"#N/A"}}]
[346,"UR020CN102",{"$f":"VLOOKUP(B351,LINGUA!$B:$H,2,0)","v":"heaterSteam 20 kg/h , 575Vac 3~, ON/OFF or proportional, full optional version"},{"$error":"#N/A"},null,{"$f":"IF(SELECTION!$C$46=\"Eur\",CODICI!D351,CODICI!D351*SELECTION!$C$48)","v":{"$error":"#N/A"}}]
[347,"UR020CW002",{"$f":"VLOOKUP(B352,LINGUA!$B:$H,2,0)","v":"heaterSteam 20 kg/h , 208Vac 3~, ON/OFF or proportional, basic version"},{"$error":"#N/A"},null,{"$f":"IF(SELECTION!$C$46=\"Eur\",CODICI!D352,CODICI!D352*SELECTION!$C$48)","v":{"$error":"#N/A"}}]
[348,"UR020CW102",{"$f":"VLOOKUP(B353,LINGUA!$B:$H,2,0)","v":"heaterSteam 20 kg/h , 208Vac 3~, ON/OFF or proportional, full optional version"},{"$error":"#N/A"},null,{"$f":"IF(SELECTION!$C$46=\"Eur\",CODICI!D353,CODICI!D353*SELECTION!$C$48)","v":{"$error":"#N/A"}}]
[349,"UR020HK003",{"$f":"VLOOKUP(B354,LINGUA!$B:$H,2,0)","v":"heaterSteam process, 20 kg/h , 230Vac 3~, with regulation"},{"v":3047,"d":"€ 3,047.00"},null,{"$f":"IF(SELECTION!$C$46=\"Eur\",CODICI!D354,CODICI!D354*SELECTION!$C$48)","v":{"v":3047,"d":"€ 3,047.00"}}]
[350,"UR020HK103",{"$f":"VLOOKUP(B355,LINGUA!$B:$H,2,0)","v":"heaterSteam 20 kg/h , 230Vac 3~, with regulation, Titanium version"},{"v":3493,"d":"€ 3,493.00"},null,{"$f":"IF(SELECTION!$C$46=\"Eur\",CODICI!D355,CODICI!D355*SELECTION!$C$48)","v":{"v":3493,"d":"€ 3,493.00"}}]
[351,"UR020HL003",{"$f":"VLOOKUP(B356,LINGUA!$B:$H,2,0)","v":"heaterSteam process, 20 kg/h , 400Vac 3~, with regulation"},{"v":3047,"d":"€ 3,047.00"},null,{"$f":"IF(SELECTION!$C$46=\"Eur\",CODICI!D356,CODICI!D356*SELECTION!$C$48)","v":{"v":3047,"d":"€ 3,047.00"}}]
[352,"UR020HL103",{"$f":"VLOOKUP(B357,LINGUA!$B:$H,2,0)","v":"heaterSteam 20 kg/h , 400Vac 3~, with regulation, Titanium version"},{"v":3493,"d":"€ 3,493.00"},null,{"$f":"IF(SELECTION!$C$46=\"Eur\",CODICI!D357,CODICI!D357*SELECTION!$C$48)","v":{"v":3493,"d":"€ 3,493.00"}}]
[353,"UR020HM003",{"$f":"VLOOKUP(B358,LINGUA!$B:$H,2,0)","v":"heaterSteam process, 20 kg/h , 460Vac 3~, with regulation"},{"v":3078,"d":"€ 3,078.00"},null,{"$f":"IF(SELECTION!$C$46=\"Eur\",CODICI!D358,CODICI!D358*SELECTION!$C$48)","v":{"v":3078,"d":"€ 3,078.00"}}]
[354,"UR020HM103",{"$f":"VLOOKUP(B359,LINGUA!$B:$H,2,0)","v":"heaterSteam 20 kg/h , 460Vac 3~, with regulation, Titanium version"},{"v":3528,"d":"€ 3,528.00"},null,{"$f":"IF(SELECTION!$C$46=\"Eur\",CODICI!D359,CODICI!D359*SELECTION!$C$48)","v":{"v":3528,"d":"€ 3,528.00"}}]
[355,"UR020HN002",{"$f":"VLOOKUP(B360,LINGUA!$B:$H,2,0)","v":"heaterSteam 20 kg/h , 575Vac 3~, with regulation, basic version"},{"v":3047,"d":"€ 3,047.00"},null,{"$f":"IF(SELECTION!$C$46=\"Eur\",CODICI!D360,CODICI!D360*SELECTION!$C$48)","v":{"v":3047,"d":"€ 3,047.00"}}]
[356,"UR020HN102",{"$f":"VLOOKUP(B361,LINGUA!$B:$H,2,0)","v":"heaterSteam 20 kg/h , 575Vac 3~, with regulation, full optional version"},{"v":3310,"d":"€ 3,310.00"},null,{"$f":"IF(SELECTION!$C$46=\"Eur\",CODICI!D361,CODICI!D361*SELECTION!$C$48)","v":{"v":3310,"d":"€ 3,310.00"}}]
[357,"UR020HW002",{"$f":"VLOOKUP(B362,LINGUA!$B:$H,2,0)","v":"heaterSteam 20 kg/h , 208Vac 3~, with regulation, basic version"},{"v":3047,"d":"€ 3,047.00"},null,{"$f":"IF(SELECTION!$C$46=\"Eur\",CODICI!D362,CODICI!D362*SELECTION!$C$48)","v":{"v":3047,"d":"€ 3,047.00"}}]
[358,"UR020HW102",{"$f":"VLOOKUP(B363,LINGUA!$B:$H,2,0)","v":"heaterSteam 20 kg/h , 208Vac 3~, with regulation, full optional version"},{"v":3310,"d":"€ 3,310.00"},null,{"$f":"IF(SELECTION!$C$46=\"Eur\",CODICI!D363,CODICI!D363*SELECTION!$C$48)","v":{"v":3310,"d":"€ 3,310.00"}}]
[359,"UR027CK002",{"$f":"VLOOKUP(B364,LINGUA!$B:$H,2,0)","v":"heaterSteam 27 kg/h , 230Vac 3~, ON/OFF or proportional, basic version"},{"$error":"#N/A"},null,{"$f":"IF(SELECTION!$C$46=\"Eur\",CODICI!D364,CODICI!D364*SELECTION!$C$48)","v":{"$error":"#N/A"}}]
[360,"UR027CK102",{"$f":"VLOOKUP(B365,LINGUA!$B:$H,2,0)","v":"heaterSteam 27 kg/h , 230Vac 3~, ON/OFF or proportional, full optional version"},{"$error":"#N/A"},null,{"$f":"IF(SELECTION!$C$46=\"Eur\",CODICI!D365,CODICI!D365*SELECTION!$C$48)","v":{"$error":"#N/A"}}]
[361,"UR027CL002",{"$f":"VLOOKUP(B366,LINGUA!$B:$H,2,0)","v":"heaterSteam 27 kg/h , 400Vac 3~, ON/OFF or proportional, basic version"},{"$error":"#N/A"},null,{"$f":"IF(SELECTION!$C$46=\"Eur\",CODICI!D366,CODICI!D366*SELECTION!$C$48)","v":{"$error":"#N/A"}}]
[362,"UR027CL102",{"$f":"VLOOKUP(B367,LINGUA!$B:$H,2,0)","v":"heaterSteam 27 kg/h , 400Vac 3~, ON/OFF or proportional, full optional version"},{"$error":"#N/A"},null,{"$f":"IF(SELECTION!$C$46=\"Eur\",CODICI!D367,CODICI!D367*SELECTION!$C$48)","v":{"$error":"#N/A"}}]
[363,"UR027CM002",{"$f":"VLOOKUP(B368,LINGUA!$B:$H,2,0)","v":"heaterSteam 27 kg/h , 460Vac 3~, ON/OFF or proportional, basic version"},{"$error":"#N/A"},null,{"$f":"IF(SELECTION!$C$46=\"Eur\",CODICI!D368,CODICI!D368*SELECTION!$C$48)","v":{"$error":"#N/A"}}]
[364,"UR027CM102",{"$f":"VLOOKUP(B369,LINGUA!$B:$H,2,0)","v":"heaterSteam 27 kg/h , 460Vac 3~, ON/OFF or proportional, full optional version"},{"$error":"#N/A"},null,{"$f":"IF(SELECTION!$C$46=\"Eur\",CODICI!D369,CODICI!D369*SELECTION!$C$48)","v":{"$error":"#N/A"}}]
[365,"UR027CN002",{"$f":"VLOOKUP(B370,LINGUA!$B:$H,2,0)","v":"heaterSteam 27 kg/h , 575Vac 3~, ON/OFF or proportional, basic version"},{"$error":"#N/A"},null,{"$f":"IF(SELECTION!$C$46=\"Eur\",CODICI!D370,CODICI!D370*SELECTION!$C$48)","v":{"$error":"#N/A"}}]
[366,"UR027CN102",{"$f":"VLOOKUP(B371,LINGUA!$B:$H,2,0)","v":"heaterSteam 27 kg/h , 575Vac 3~, ON/OFF or proportional, full optional version"},{"$error":"#N/A"},null,{"$f":"IF(SELECTION!$C$46=\"Eur\",CODICI!D371,CODICI!D371*SELECTION!$C$48)","v":{"$error":"#N/A"}}]
[367,"UR027CW002",{"$f":"VLOOKUP(B372,LINGUA!$B:$H,2,0)","v":"heaterSteam 27 kg/h , 208Vac 3~, ON/OFF or proportional, basic version"},{"$error":"#N/A"},null,{"$f":"IF(SELECTION!$C$46=\"Eur\",CODICI!D372,CODICI!D372*SELECTION!$C$48)","v":{"$error":"#N/A"}}]
[368,"UR027CW102",{"$f":"VLOOKUP(B373,LINGUA!$B:$H,2,0)","v":"heaterSteam 27 kg/h , 208Vac 3~, ON/OFF or proportional, full optional version"},{"$error":"#N/A"},null,{"$f":"IF(SELECTION!$C$46=\"Eur\",CODICI!D373,CODICI!D373*SELECTION!$C$48)","v":{"$error":"#N/A"}}]
[369,"UR027HK003",{"$f":"VLOOKUP(B374,LINGUA!$B:$H,2,0)","v":"heaterSteam process, 27 kg/h , 230Vac 3~, with regulation"},{"v":3152,"d":"€ 3,152.00"},null,{"$f":"IF(SELECTION!$C$46=\"Eur\",CODICI!D374,CODICI!D374*SELECTION!$C$48)","v":{"v":3152,"d":"€ 3,152.00"}}]
[370,"UR027HK103",{"$f":"VLOOKUP(B375,LINGUA!$B:$H,2,0)","v":"heaterSteam 27 kg/h , 230Vac 3~, with regulation, Titanium version"},{"v":3604,"d":"€ 3,604.00"},null,{"$f":"IF(SELECTION!$C$46=\"Eur\",CODICI!D375,CODICI!D375*SELECTION!$C$48)","v":{"v":3604,"d":"€ 3,604.00"}}]
[371,"UR027HL003",{"$f":"VLOOKUP(B376,LINGUA!$B:$H,2,0)","v":"heaterSteam process, 27 kg/h , 400Vac 3~, with regulation"},{"v":3152,"d":"€ 3,152.00"},null,{"$f":"IF(SELECTION!$C$46=\"Eur\",CODICI!D376,CODICI!D376*SELECTION!$C$48)","v":{"v":3152,"d":"€ 3,152.00"}}]
[372,"UR027HL103",{"$f":"VLOOKUP(B377,LINGUA!$B:$H,2,0)","v":"heaterSteam 27 kg/h , 400Vac 3~, with regulation, Titanium version"},{"v":3604,"d":"€ 3,604.00"},null,{"$f":"IF(SELECTION!$C$46=\"Eur\",CODICI!D377,CODICI!D377*SELECTION!$C$48)","v":{"v":3604,"d":"€ 3,604.00"}}]
[373,"UR027HM003",{"$f":"VLOOKUP(B378,LINGUA!$B:$H,2,0)","v":"heaterSteam process, 27 kg/h , 460Vac 3~, with regulation"},{"v":3184,"d":"€ 3,184.00"},null,{"$f":"IF(SELECTION!$C$46=\"Eur\",CODICI!D378,CODICI!D378*SELECTION!$C$48)","v":{"v":3184,"d":"€ 3,184.00"}}]
[374,"UR027HM103",{"$f":"VLOOKUP(B379,LINGUA!$B:$H,2,0)","v":"heaterSteam 27 kg/h , 460Vac 3~, with regulation, Titanium version"},{"v":3640,"d":"€ 3,640.00"},null,{"$f":"IF(SELECTION!$C$46=\"Eur\",CODICI!D379,CODICI!D379*SELECTION!$C$48)","v":{"v":3640,"d":"€ 3,640.00"}}]
[375,"UR027HN002",{"$f":"VLOOKUP(B380,LINGUA!$B:$H,2,0)","v":"heaterSteam 27 kg/h , 575Vac 3~, with regulation, basic version"},{"v":3152,"d":"€ 3,152.00"},null,{"$f":"IF(SELECTION!$C$46=\"Eur\",CODICI!D380,CODICI!D380*SELECTION!$C$48)","v":{"v":3152,"d":"€ 3,152.00"}}]
[376,"UR027HN102",{"$f":"VLOOKUP(B381,LINGUA!$B:$H,2,0)","v":"heaterSteam 27 kg/h , 575Vac 3~, with regulation, full optional version"},{"v":3415,"d":"€ 3,415.00"},null,{"$f":"IF(SELECTION!$C$46=\"Eur\",CODICI!D381,CODICI!D381*SELECTION!$C$48)","v":{"v":3415,"d":"€ 3,415.00"}}]
[377,"UR027HW002",{"$f":"VLOOKUP(B382,LINGUA!$B:$H,2,0)","v":"heaterSteam 27 kg/h , 208Vac 3~, with regulation, basic version"},{"v":3152,"d":"€ 3,152.00"},null,{"$f":"IF(SELECTION!$C$46=\"Eur\",CODICI!D382,CODICI!D382*SELECTION!$C$48)","v":{"v":3152,"d":"€ 3,152.00"}}]
[378,"UR027HW102",{"$f":"VLOOKUP(B383,LINGUA!$B:$H,2,0)","v":"heaterSteam 27 kg/h , 208Vac 3~, with regulation, full optional version"},{"v":3415,"d":"€ 3,415.00"},null,{"$f":"IF(SELECTION!$C$46=\"Eur\",CODICI!D383,CODICI!D383*SELECTION!$C$48)","v":{"v":3415,"d":"€ 3,415.00"}}]
[379,"UR040CK002",{"$f":"VLOOKUP(B384,LINGUA!$B:$H,2,0)","v":"heaterSteam 40 kg/h , 230Vac 3~, ON/OFF or proportional, basic version"},{"$error":"#N/A"},null,{"$f":"IF(SELECTION!$C$46=\"Eur\",CODICI!D384,CODICI!D384*SELECTION!$C$48)","v":{"$error":"#N/A"}}]
[380,"UR040CK102",{"$f":"VLOOKUP(B385,LINGUA!$B:$H,2,0)","v":"heaterSteam 40 kg/h , 230Vac 3~, ON/OFF or proportional, full optional version"},{"$error":"#N/A"},null,{"$f":"IF(SELECTION!$C$46=\"Eur\",CODICI!D385,CODICI!D385*SELECTION!$C$48)","v":{"$error":"#N/A"}}]
[381,"UR040CL002",{"$f":"VLOOKUP(B386,LINGUA!$B:$H,2,0)","v":"heaterSteam 40 kg/h , 400Vac 3~, ON/OFF or proportional, basic version"},{"$error":"#N/A"},null,{"$f":"IF(SELECTION!$C$46=\"Eur\",CODICI!D386,CODICI!D386*SELECTION!$C$48)","v":{"$error":"#N/A"}}]
[382,"UR040CL102",{"$f":"VLOOKUP(B387,LINGUA!$B:$H,2,0)","v":"heaterSteam 40 kg/h , 400Vac 3~, ON/OFF or proportional, full optional version"},{"$error":"#N/A"},null,{"$f":"IF(SELECTION!$C$46=\"Eur\",CODICI!D387,CODICI!D387*SELECTION!$C$48)","v":{"$error":"#N/A"}}]
[383,"UR040CM002",{"$f":"VLOOKUP(B388,LINGUA!$B:$H,2,0)","v":"heaterSteam 40 kg/h , 460Vac 3~, ON/OFF or proportional, basic version"},{"$error":"#N/A"},null,{"$f":"IF(SELECTION!$C$46=\"Eur\",CODICI!D388,CODICI!D388*SELECTION!$C$48)","v":{"$error":"#N/A"}}]
[384,"UR040CM102",{"$f":"VLOOKUP(B389,LINGUA!$B:$H,2,0)","v":"heaterSteam 40 kg/h , 460Vac 3~, ON/OFF or proportional, full optional version"},{"$error":"#N/A"},null,{"$f":"IF(SELECTION!$C$46=\"Eur\",CODICI!D389,CODICI!D389*SELECTION!$C$48)","v":{"$error":"#N/A"}}]
[385,"UR040CN002",{"$f":"VLOOKUP(B390,LINGUA!$B:$H,2,0)","v":"heaterSteam 40 kg/h , 575Vac 3~, ON/OFF or proportional, basic version"},{"$error":"#N/A"},null,{"$f":"IF(SELECTION!$C$46=\"Eur\",CODICI!D390,CODICI!D390*SELECTION!$C$48)","v":{"$error":"#N/A"}}]
[386,"UR040CN102",{"$f":"VLOOKUP(B391,LINGUA!$B:$H,2,0)","v":"heaterSteam 40 kg/h , 575Vac 3~, ON/OFF or proportional, full optional version"},{"$error":"#N/A"},null,{"$f":"IF(SELECTION!$C$46=\"Eur\",CODICI!D391,CODICI!D391*SELECTION!$C$48)","v":{"$error":"#N/A"}}]
[{"$f":"+A391+1","v":387},"UR040CW002",{"$f":"VLOOKUP(B392,LINGUA!$B:$H,2,0)","v":"heaterSteam 40 kg/h , 208Vac 3~, ON/OFF or proportional, basic version"},{"$error":"#N/A"},null,{"$f":"IF(SELECTION!$C$46=\"Eur\",CODICI!D392,CODICI!D392*SELECTION!$C$48)","v":{"$error":"#N/A"}}]
[388,"UR040CW102",{"$f":"VLOOKUP(B393,LINGUA!$B:$H,2,0)","v":"heaterSteam 40 kg/h , 208Vac 3~, ON/OFF or proportional, full optional version"},{"$error":"#N/A"},null,{"$f":"IF(SELECTION!$C$46=\"Eur\",CODICI!D393,CODICI!D393*SELECTION!$C$48)","v":{"$error":"#N/A"}}]
[389,"UR040HK002",{"$f":"VLOOKUP(B394,LINGUA!$B:$H,2,0)","v":"heaterSteam 40 kg/h , 230Vac 3~, with regulation, basic version"},{"v":4413,"d":"€ 4,413.00"},null,{"$f":"IF(SELECTION!$C$46=\"Eur\",CODICI!D394,CODICI!D394*SELECTION!$C$48)","v":{"v":4413,"d":"€ 4,413.00"}}]
[390,"UR040HK102",{"$f":"VLOOKUP(B395,LINGUA!$B:$H,2,0)","v":"heaterSteam 40 kg/h , 230Vac 3~, with regulation, full optional version"},{"v":4833,"d":"€ 4,833.00"},null,{"$f":"IF(SELECTION!$C$46=\"Eur\",CODICI!D395,CODICI!D395*SELECTION!$C$48)","v":{"v":4833,"d":"€ 4,833.00"}}]
[391,"UR040HL003",{"$f":"VLOOKUP(B396,LINGUA!$B:$H,2,0)","v":"heaterSteam process, 40 kg/h , 400Vac 3~, with regulation"},{"v":4413,"d":"€ 4,413.00"},null,{"$f":"IF(SELECTION!$C$46=\"Eur\",CODICI!D396,CODICI!D396*SELECTION!$C$48)","v":{"v":4413,"d":"€ 4,413.00"}}]
[392,"UR040HL103",{"$f":"VLOOKUP(B397,LINGUA!$B:$H,2,0)","v":"heaterSteam 40 kg/h , 400Vac 3~, with regulation, Titanium version"},{"v":5131,"d":"€ 5,131.00"},null,{"$f":"IF(SELECTION!$C$46=\"Eur\",CODICI!D397,CODICI!D397*SELECTION!$C$48)","v":{"v":5131,"d":"€ 5,131.00"}}]
[393,"UR040HM003",{"$f":"VLOOKUP(B398,LINGUA!$B:$H,2,0)","v":"heaterSteam process, 40 kg/h , 460Vac 3~, with regulation"},{"v":4458,"d":"€ 4,458.00"},null,{"$f":"IF(SELECTION!$C$46=\"Eur\",CODICI!D398,CODICI!D398*SELECTION!$C$48)","v":{"v":4458,"d":"€ 4,458.00"}}]
[394,"UR040HM103",{"$f":"VLOOKUP(B399,LINGUA!$B:$H,2,0)","v":"heaterSteam 40 kg/h , 460Vac 3~, with regulation, Titanium version"},{"v":5183,"d":"€ 5,183.00"},null,{"$f":"IF(SELECTION!$C$46=\"Eur\",CODICI!D399,CODICI!D399*SELECTION!$C$48)","v":{"v":5183,"d":"€ 5,183.00"}}]
[395,"UR040HN002",{"$f":"VLOOKUP(B400,LINGUA!$B:$H,2,0)","v":"heaterSteam 40 kg/h , 575Vac 3~, with regulation, basic version"},{"v":4413,"d":"€ 4,413.00"},null,{"$f":"IF(SELECTION!$C$46=\"Eur\",CODICI!D400,CODICI!D400*SELECTION!$C$48)","v":{"v":4413,"d":"€ 4,413.00"}}]
[396,"UR040HN102",{"$f":"VLOOKUP(B401,LINGUA!$B:$H,2,0)","v":"heaterSteam 40 kg/h , 575Vac 3~, with regulation, full optional version"},{"v":4833,"d":"€ 4,833.00"},null,{"$f":"IF(SELECTION!$C$46=\"Eur\",CODICI!D401,CODICI!D401*SELECTION!$C$48)","v":{"v":4833,"d":"€ 4,833.00"}}]
[397,"UR040HW002",{"$f":"VLOOKUP(B402,LINGUA!$B:$H,2,0)","v":"heaterSteam 40 kg/h , 208Vac 3~, with regulation, basic version"},{"v":4413,"d":"€ 4,413.00"},null,{"$f":"IF(SELECTION!$C$46=\"Eur\",CODICI!D402,CODICI!D402*SELECTION!$C$48)","v":{"v":4413,"d":"€ 4,413.00"}}]
[398,"UR040HW102",{"$f":"VLOOKUP(B403,LINGUA!$B:$H,2,0)","v":"heaterSteam 40 kg/h , 208Vac 3~, with regulation, full optional version"},{"v":4833,"d":"€ 4,833.00"},null,{"$f":"IF(SELECTION!$C$46=\"Eur\",CODICI!D403,CODICI!D403*SELECTION!$C$48)","v":{"v":4833,"d":"€ 4,833.00"}}]
[399,"UR053HL003",{"$f":"VLOOKUP(B404,LINGUA!$B:$H,2,0)","v":"heaterSteam process, 53 kg/h , 400Vac 3~, with regulation"},{"v":4894,"d":"€ 4,894.00"},null,{"$f":"IF(SELECTION!$C$46=\"Eur\",CODICI!D404,CODICI!D404*SELECTION!$C$48)","v":{"v":4894,"d":"€ 4,894.00"}}]
[400,"UR053HL103",{"$f":"VLOOKUP(B405,LINGUA!$B:$H,2,0)","v":"heaterSteam 53 kg/h , 400Vac 3~, with regulation, Titanium version"},{"v":5616,"d":"€ 5,616.00"},null,{"$f":"IF(SELECTION!$C$46=\"Eur\",CODICI!D405,CODICI!D405*SELECTION!$C$48)","v":{"v":5616,"d":"€ 5,616.00"}}]
[401,"UR053HM003",{"$f":"VLOOKUP(B406,LINGUA!$B:$H,2,0)","v":"heaterSteam process, 53 kg/h , 460Vac 3~, with regulation"},{"v":4943,"d":"€ 4,943.00"},null,{"$f":"IF(SELECTION!$C$46=\"Eur\",CODICI!D406,CODICI!D406*SELECTION!$C$48)","v":{"v":4943,"d":"€ 4,943.00"}}]
[402,"UR053HM103",{"$f":"VLOOKUP(B407,LINGUA!$B:$H,2,0)","v":"heaterSteam 53 kg/h , 460Vac 3~, with regulation, Titanium version"},{"v":5673,"d":"€ 5,673.00"},null,{"$f":"IF(SELECTION!$C$46=\"Eur\",CODICI!D407,CODICI!D407*SELECTION!$C$48)","v":{"v":5673,"d":"€ 5,673.00"}}]
[403,"UR053HN002",{"$f":"VLOOKUP(B408,LINGUA!$B:$H,2,0)","v":"heaterSteam 53 kg/h , 575Vac 3~, with regulation, basic version"},{"v":4894,"d":"€ 4,894.00"},null,{"$f":"IF(SELECTION!$C$46=\"Eur\",CODICI!D408,CODICI!D408*SELECTION!$C$48)","v":{"v":4894,"d":"€ 4,894.00"}}]
[404,"UR053HN102",{"$f":"VLOOKUP(B409,LINGUA!$B:$H,2,0)","v":"heaterSteam 53 kg/h , 575Vac 3~, with regulation, full optional version"},{"v":5401,"d":"€ 5,401.00"},null,{"$f":"IF(SELECTION!$C$46=\"Eur\",CODICI!D409,CODICI!D409*SELECTION!$C$48)","v":{"v":5401,"d":"€ 5,401.00"}}]
[405,"UR060CK002",{"$f":"VLOOKUP(B410,LINGUA!$B:$H,2,0)","v":"heaterSteam 60 kg/h , 230Vac 3~, ON/OFF or proportional, basic version"},{"$error":"#N/A"},null,{"$f":"IF(SELECTION!$C$46=\"Eur\",CODICI!D410,CODICI!D410*SELECTION!$C$48)","v":{"$error":"#N/A"}}]
[406,"UR060CK102",{"$f":"VLOOKUP(B411,LINGUA!$B:$H,2,0)","v":"heaterSteam 60 kg/h , 230Vac 3~, ON/OFF or proportional, full optional version"},{"$error":"#N/A"},null,{"$f":"IF(SELECTION!$C$46=\"Eur\",CODICI!D411,CODICI!D411*SELECTION!$C$48)","v":{"$error":"#N/A"}}]
[407,"UR060CL002",{"$f":"VLOOKUP(B412,LINGUA!$B:$H,2,0)","v":"heaterSteam 60 kg/h , 400Vac 3~, ON/OFF or proportional, basic version"},{"$error":"#N/A"},null,{"$f":"IF(SELECTION!$C$46=\"Eur\",CODICI!D412,CODICI!D412*SELECTION!$C$48)","v":{"$error":"#N/A"}}]
[408,"UR060CL102",{"$f":"VLOOKUP(B413,LINGUA!$B:$H,2,0)","v":"heaterSteam 60 kg/h , 400Vac 3~, ON/OFF or proportional, full optional version"},{"$error":"#N/A"},null,{"$f":"IF(SELECTION!$C$46=\"Eur\",CODICI!D413,CODICI!D413*SELECTION!$C$48)","v":{"$error":"#N/A"}}]
[409,"UR060CM002",{"$f":"VLOOKUP(B414,LINGUA!$B:$H,2,0)","v":"heaterSteam 60 kg/h , 460Vac 3~, ON/OFF or proportional, basic version"},{"$error":"#N/A"},null,{"$f":"IF(SELECTION!$C$46=\"Eur\",CODICI!D414,CODICI!D414*SELECTION!$C$48)","v":{"$error":"#N/A"}}]
[410,"UR060CM102",{"$f":"VLOOKUP(B415,LINGUA!$B:$H,2,0)","v":"heaterSteam 60 kg/h , 460Vac 3~, ON/OFF or proportional, full optional version"},{"$error":"#N/A"},null,{"$f":"IF(SELECTION!$C$46=\"Eur\",CODICI!D415,CODICI!D415*SELECTION!$C$48)","v":{"$error":"#N/A"}}]
[411,"UR060CN002",{"$f":"VLOOKUP(B416,LINGUA!$B:$H,2,0)","v":"heaterSteam 60 kg/h , 575Vac 3~, ON/OFF or proportional, basic version"},{"$error":"#N/A"},null,{"$f":"IF(SELECTION!$C$46=\"Eur\",CODICI!D416,CODICI!D416*SELECTION!$C$48)","v":{"$error":"#N/A"}}]
[412,"UR060CN102",{"$f":"VLOOKUP(B417,LINGUA!$B:$H,2,0)","v":"heaterSteam 60 kg/h , 575Vac 3~, ON/OFF or proportional, full optional version"},{"$error":"#N/A"},null,{"$f":"IF(SELECTION!$C$46=\"Eur\",CODICI!D417,CODICI!D417*SELECTION!$C$48)","v":{"$error":"#N/A"}}]
[413,"UR060CW002",{"$f":"VLOOKUP(B418,LINGUA!$B:$H,2,0)","v":"heaterSteam 60 kg/h , 208Vac 3~, ON/OFF or proportional, basic version"},{"$error":"#N/A"},null,{"$f":"IF(SELECTION!$C$46=\"Eur\",CODICI!D418,CODICI!D418*SELECTION!$C$48)","v":{"$error":"#N/A"}}]
[414,"UR060CW102",{"$f":"VLOOKUP(B419,LINGUA!$B:$H,2,0)","v":"heaterSteam 60 kg/h , 208Vac 3~, ON/OFF or proportional, full optional version"},{"$error":"#N/A"},null,{"$f":"IF(SELECTION!$C$46=\"Eur\",CODICI!D419,CODICI!D419*SELECTION!$C$48)","v":{"$error":"#N/A"}}]
[415,"UR060HK002",{"$f":"VLOOKUP(B420,LINGUA!$B:$H,2,0)","v":"heaterSteam 60 kg/h , 230Vac 3~, with regulation, basic version"},{"v":5253,"d":"€ 5,253.00"},null,{"$f":"IF(SELECTION!$C$46=\"Eur\",CODICI!D420,CODICI!D420*SELECTION!$C$48)","v":{"v":5253,"d":"€ 5,253.00"}}]
[416,"UR060HK102",{"$f":"VLOOKUP(B421,LINGUA!$B:$H,2,0)","v":"heaterSteam 60 kg/h , 230Vac 3~, with regulation, full optional version"},{"v":5778,"d":"€ 5,778.00"},null,{"$f":"IF(SELECTION!$C$46=\"Eur\",CODICI!D421,CODICI!D421*SELECTION!$C$48)","v":{"v":5778,"d":"€ 5,778.00"}}]
[417,"UR060HL003",{"$f":"VLOOKUP(B422,LINGUA!$B:$H,2,0)","v":"heaterSteam process, 60 kg/h , 400Vac 3~, with regulation"},{"v":5253,"d":"€ 5,253.00"},null,{"$f":"IF(SELECTION!$C$46=\"Eur\",CODICI!D422,CODICI!D422*SELECTION!$C$48)","v":{"v":5253,"d":"€ 5,253.00"}}]
[418,"UR060HL103",{"$f":"VLOOKUP(B423,LINGUA!$B:$H,2,0)","v":"heaterSteam 60 kg/h , 400Vac 3~, with regulation, Titanium version"},{"v":6074,"d":"€ 6,074.00"},null,{"$f":"IF(SELECTION!$C$46=\"Eur\",CODICI!D423,CODICI!D423*SELECTION!$C$48)","v":{"v":6074,"d":"€ 6,074.00"}}]
[419,"UR060HM003",{"$f":"VLOOKUP(B424,LINGUA!$B:$H,2,0)","v":"heaterSteam process, 60 kg/h , 460Vac 3~, with regulation"},{"v":5306,"d":"€ 5,306.00"},null,{"$f":"IF(SELECTION!$C$46=\"Eur\",CODICI!D424,CODICI!D424*SELECTION!$C$48)","v":{"v":5306,"d":"€ 5,306.00"}}]
[420,"UR060HM103",{"$f":"VLOOKUP(B425,LINGUA!$B:$H,2,0)","v":"heaterSteam 60 kg/h , 460Vac 3~, with regulation, Titanium version"},{"v":6135,"d":"€ 6,135.00"},null,{"$f":"IF(SELECTION!$C$46=\"Eur\",CODICI!D425,CODICI!D425*SELECTION!$C$48)","v":{"v":6135,"d":"€ 6,135.00"}}]
[421,"UR060HN002",{"$f":"VLOOKUP(B426,LINGUA!$B:$H,2,0)","v":"heaterSteam 60 kg/h , 575Vac 3~, with regulation, basic version"},{"v":5253,"d":"€ 5,253.00"},null,{"$f":"IF(SELECTION!$C$46=\"Eur\",CODICI!D426,CODICI!D426*SELECTION!$C$48)","v":{"v":5253,"d":"€ 5,253.00"}}]
[422,"UR060HN102",{"$f":"VLOOKUP(B427,LINGUA!$B:$H,2,0)","v":"heaterSteam 60 kg/h , 575Vac 3~, with regulation, full optional version"},{"v":5778,"d":"€ 5,778.00"},null,{"$f":"IF(SELECTION!$C$46=\"Eur\",CODICI!D427,CODICI!D427*SELECTION!$C$48)","v":{"v":5778,"d":"€ 5,778.00"}}]
[423,"UR060HW002",{"$f":"VLOOKUP(B428,LINGUA!$B:$H,2,0)","v":"heaterSteam 60 kg/h , 208Vac 3~, with regulation, basic version"},{"v":5253,"d":"€ 5,253.00"},null,{"$f":"IF(SELECTION!$C$46=\"Eur\",CODICI!D428,CODICI!D428*SELECTION!$C$48)","v":{"v":5253,"d":"€ 5,253.00"}}]
[424,"UR060HW102",{"$f":"VLOOKUP(B429,LINGUA!$B:$H,2,0)","v":"heaterSteam 60 kg/h , 208Vac 3~, with regulation, full optional version"},{"v":5778,"d":"€ 5,778.00"},null,{"$f":"IF(SELECTION!$C$46=\"Eur\",CODICI!D429,CODICI!D429*SELECTION!$C$48)","v":{"v":5778,"d":"€ 5,778.00"}}]
[425,"UR080HL003",{"$f":"VLOOKUP(B430,LINGUA!$B:$H,2,0)","v":"heaterSteam process, 80 kg/h , 400Vac 3~, with regulation"},{"v":5955,"d":"€ 5,955.00"},null,{"$f":"IF(SELECTION!$C$46=\"Eur\",CODICI!D430,CODICI!D430*SELECTION!$C$48)","v":{"v":5955,"d":"€ 5,955.00"}}]
[426,"UR080HL103",{"$f":"VLOOKUP(B431,LINGUA!$B:$H,2,0)","v":"heaterSteam 80 kg/h , 400Vac 3~, with regulation, Titanium version"},{"v":6769,"d":"€ 6,769.00"},null,{"$f":"IF(SELECTION!$C$46=\"Eur\",CODICI!D431,CODICI!D431*SELECTION!$C$48)","v":{"v":6769,"d":"€ 6,769.00"}}]
[427,"UR080HM003",{"$f":"VLOOKUP(B432,LINGUA!$B:$H,2,0)","v":"heaterSteam process, 80 kg/h , 460Vac 3~, with regulation"},{"v":6105,"d":"€ 6,105.00"},null,{"$f":"IF(SELECTION!$C$46=\"Eur\",CODICI!D432,CODICI!D432*SELECTION!$C$48)","v":{"v":6105,"d":"€ 6,105.00"}}]
[428,"UR080HM103",{"$f":"VLOOKUP(B433,LINGUA!$B:$H,2,0)","v":"heaterSteam 80 kg/h , 460Vac 3~, with regulation, Titanium version"},{"v":6837,"d":"€ 6,837.00"},null,{"$f":"IF(SELECTION!$C$46=\"Eur\",CODICI!D433,CODICI!D433*SELECTION!$C$48)","v":{"v":6837,"d":"€ 6,837.00"}}]
[429,"UR080HN002",{"$f":"VLOOKUP(B434,LINGUA!$B:$H,2,0)","v":"heaterSteam 80 kg/h , 575Vac 3~, with regulation, basic version"},{"v":5955,"d":"€ 5,955.00"},null,{"$f":"IF(SELECTION!$C$46=\"Eur\",CODICI!D434,CODICI!D434*SELECTION!$C$48)","v":{"v":5955,"d":"€ 5,955.00"}}]
[430,"UR080HN102",{"$f":"VLOOKUP(B435,LINGUA!$B:$H,2,0)","v":"heaterSteam 80 kg/h , 575Vac 3~, with regulation, full optional version"},{"v":6475,"d":"€ 6,475.00"},null,{"$f":"IF(SELECTION!$C$46=\"Eur\",CODICI!D435,CODICI!D435*SELECTION!$C$48)","v":{"v":6475,"d":"€ 6,475.00"}}]
[431,"UG045HD003",{"$f":"VLOOKUP(B436,LINGUA!$B:$H,2,0)","v":"Gas-fired humidifier 45 kg/h - 230 Vac 1~ (UE market)"},{"v":10202,"d":"€ 10,202.00"},null,{"$f":"IF(SELECTION!$C$46=\"Eur\",CODICI!D436,CODICI!D436*SELECTION!$C$48)","v":{"v":10202,"d":"€ 10,202.00"}}]
[432,"UG090HD003",{"$f":"VLOOKUP(B437,LINGUA!$B:$H,2,0)","v":"Gas-fired humidifier 90 kg/h - 230 Vac 1~(UE market)"},{"v":13421,"d":"€ 13,421.00"},null,{"$f":"IF(SELECTION!$C$46=\"Eur\",CODICI!D437,CODICI!D437*SELECTION!$C$48)","v":{"v":13421,"d":"€ 13,421.00"}}]
[433,"UG180HD003",{"$f":"VLOOKUP(B438,LINGUA!$B:$H,2,0)","v":"Gas-fired humidifier 180 kg/h - 230 Vac 1~(UE market)"},{"v":19328,"d":"€ 19,328.00"},null,{"$f":"IF(SELECTION!$C$46=\"Eur\",CODICI!D438,CODICI!D438*SELECTION!$C$48)","v":{"v":19328,"d":"€ 19,328.00"}}]
[434,"UG045HD103",{"$f":"VLOOKUP(B439,LINGUA!$B:$H,2,0)","v":"Gas-fired humidifier 45 kg/h - 230 Vac 1~(USA market)"},{"v":10202,"d":"€ 10,202.00"},null,{"$f":"IF(SELECTION!$C$46=\"Eur\",CODICI!D439,CODICI!D439*SELECTION!$C$48)","v":{"v":10202,"d":"€ 10,202.00"}}]
[435,"UG090HD103",{"$f":"VLOOKUP(B440,LINGUA!$B:$H,2,0)","v":"Gas-fired humidifier 90 kg/h - 230 Vac 1~ (USA market)"},{"v":13421,"d":"€ 13,421.00"},null,{"$f":"IF(SELECTION!$C$46=\"Eur\",CODICI!D440,CODICI!D440*SELECTION!$C$48)","v":{"v":13421,"d":"€ 13,421.00"}}]
[436,"UG180HD103",{"$f":"VLOOKUP(B441,LINGUA!$B:$H,2,0)","v":"Gas-fired humidifier 180 kg/h - 230 Vac 1~ (USA market)"},{"v":19328,"d":"€ 19,328.00"},null,{"$f":"IF(SELECTION!$C$46=\"Eur\",CODICI!D441,CODICI!D441*SELECTION!$C$48)","v":{"v":19328,"d":"€ 19,328.00"}}]
[437,{"$nulls":4},{"$f":"IF(SELECTION!$C$46=\"Eur\",CODICI!D442,CODICI!D442*SELECTION!$C$48)","v":0}]
[438,{"$nulls":4},{"$f":"IF(SELECTION!$C$46=\"Eur\",CODICI!D443,CODICI!D443*SELECTION!$C$48)","v":0}]
[439,"ROL1005U00",{"$f":"VLOOKUP(B444,LINGUA!B523:C531,2,0)","v":"Reverse osmosis system 100 l / h - 230V 50Hz - for steel"},{"v":7800,"d":"€ 7,800.00"},null,{"$f":"IF(SELECTION!$C$46=\"Eur\",CODICI!D444,CODICI!D444*SELECTION!$C$48)","v":{"v":7800,"d":"€ 7,800.00"}}]
[440,"ROL1006U00",{"$f":"VLOOKUP(B445,LINGUA!B524:C532,2,0)","v":"Reverse osmosis system 100 l / h - 230V 60Hz - for steel"},{"v":7800,"d":"€ 7,800.00"},null,{"$f":"IF(SELECTION!$C$46=\"Eur\",CODICI!D445,CODICI!D445*SELECTION!$C$48)","v":{"v":7800,"d":"€ 7,800.00"}}]
[441,"ROL3205U00",{"$f":"VLOOKUP(B446,LINGUA!B525:C533,2,0)","v":"Reverse osmosis system 320 l / h - 230V 50Hz - for steel"},{"v":9300,"d":"€ 9,300.00"},null,{"$f":"IF(SELECTION!$C$46=\"Eur\",CODICI!D446,CODICI!D446*SELECTION!$C$48)","v":{"v":9300,"d":"€ 9,300.00"}}]
[442,"ROL3206U00",{"$f":"VLOOKUP(B447,LINGUA!B526:C534,2,0)","v":"Reverse osmosis system 320 l / h - 230V 60Hz - for steel"},{"v":9300,"d":"€ 9,300.00"},null,{"$f":"IF(SELECTION!$C$46=\"Eur\",CODICI!D447,CODICI!D447*SELECTION!$C$48)","v":{"v":9300,"d":"€ 9,300.00"}}]
[443,"ROC0605000",{"$f":"VLOOKUP(B448,LINGUA!B527:C535,2,0)","v":"Reverse osmosis system 60 l / h - 230V 50Hz - for steel"},{"v":3900,"d":"€ 3,900.00"},null,{"$f":"IF(SELECTION!$C$46=\"Eur\",CODICI!D448,CODICI!D448*SELECTION!$C$48)","v":{"v":3900,"d":"€ 3,900.00"}}]
[444,"ROC0606000",{"$f":"VLOOKUP(B449,LINGUA!B528:C536,2,0)","v":"Reverse osmosis system 60 l / h - 230V 60Hz - for steel"},{"v":3900,"d":"€ 3,900.00"},null,{"$f":"IF(SELECTION!$C$46=\"Eur\",CODICI!D449,CODICI!D449*SELECTION!$C$48)","v":{"v":3900,"d":"€ 3,900.00"}}]
[445,"ROC025500N",{"$f":"VLOOKUP(B450,LINGUA!B529:C537,2,0)","v":"WTS compact 25 KG/H with pump"},{"v":2700,"d":"€ 2,700.00"},null,{"$f":"IF(SELECTION!$C$46=\"Eur\",CODICI!D450,CODICI!D450*SELECTION!$C$48)","v":{"v":2700,"d":"€ 2,700.00"}}]
[446,"ROKC00KTVE",{"$f":"VLOOKUP(B451,LINGUA!B530:C538,2,0)","v":"Kit expansion vessel with hoses and fittings"},{"v":171,"d":"€ 171.00"},null,{"$f":"IF(SELECTION!$C$46=\"Eur\",CODICI!D451,CODICI!D451*SELECTION!$C$48)","v":{"v":171,"d":"€ 171.00"}}]
[447,"AUC1000000",{"$f":"VLOOKUP(B452,LINGUA!B531:C539,2,0)","v":"AUTOCLAVE 100 Liters (expansion vessel)"},{"v":488.2,"d":"€ 488.20"},null,{"$f":"IF(SELECTION!$C$46=\"Eur\",CODICI!D452,CODICI!D452*SELECTION!$C$48)","v":{"v":488.2,"d":"€ 488.20"}}]
[448,"AUC2000000",{"$f":"VLOOKUP(B453,LINGUA!B532:C540,2,0)","v":"AUTOCLAVE 200 Liters (expansion vessel)"},{"v":747.8,"d":"€ 747.80"},null,{"$f":"IF(SELECTION!$C$46=\"Eur\",CODICI!D453,CODICI!D453*SELECTION!$C$48)","v":{"v":747.8,"d":"€ 747.80"}}]
[449,"AUC3000000",{"$f":"VLOOKUP(B454,LINGUA!B533:C541,2,0)","v":"AUTOCLAVE 300 Liters (expansion vessel)"},{"v":883.7,"d":"€ 883.70"},null,{"$f":"IF(SELECTION!$C$46=\"Eur\",CODICI!D454,CODICI!D454*SELECTION!$C$48)","v":{"v":883.7,"d":"€ 883.70"}}]
[450,{"$nulls":4},{"$f":"IF(SELECTION!$C$46=\"Eur\",CODICI!D455,CODICI!D455*SELECTION!$C$48)","v":0}]
[{"$f":"+A455+1","v":451},"ROKL00AS01",{"$f":"VLOOKUP(B456,LINGUA!B535:C543,2,0)","v":"Antiscale liquid 25Kg (antiscalant)"},{"v":229.7,"d":"€ 229.70"},null,{"$f":"IF(SELECTION!$C$46=\"Eur\",CODICI!D456,CODICI!D456*SELECTION!$C$48)","v":{"v":229.7,"d":"€ 229.70"}}]
[{"$f":"+A456+1","v":452},"ROKL00AS00",{"$f":"VLOOKUP(B457,LINGUA!B536:C544,2,0)","v":"Antiscale liquid NSF- 25Kg (antiscalant)"},{"v":402.7,"d":"€ 402.70"},null,{"$f":"IF(SELECTION!$C$46=\"Eur\",CODICI!D457,CODICI!D457*SELECTION!$C$48)","v":{"v":402.7,"d":"€ 402.70"}}]

{"sheet":"LINGUA","index":1,"n_rows":942,"n_cols":11,"rows_kept":942,"hidden":true}
[null,"If needed change the language in the grey cells            DO NOT MODIFY IN ANY WAY THE FIRST THREE COLUMNS A, B AND C","ENGLISH","ITALIANO","ENGLISH","FRANCAIS","DEUTSCH","ESPAÑOL"]
[null,"AZIONE AUTOMATICA","SENTENCE TO INSERT","FRASI DA INSERIRE","SENTENCE TO INSERT",null,null,"FRASES A INSERTAR",null,"Unità di misura e limiti"]
[null,{"$f":"CONCATENATE(IF(A3=1,\" \",\"\"),C3)","v":"INSTRUCTIONS: insert input data in grey cells. Results appear in green cells."},"INSTRUCTIONS: insert input data in grey cells. Results appear in green cells.","ISTRUZIONI: inserire i dati nelle caselle grigie. I dati elaborati compaiono nelle caselle color verde","INSTRUCTIONS: insert input data in grey cells. Results appear in green cells.","INSTRUCTION: insérer les données dans les cellules grisées. Les résultats apparaissent dans les cellules vert. ","Anleitung: Die Eingabe der Daten erfolgt in die grauen Zellen. Die berechneten Ergebnisse werden in den grün Zellen ausgegeben.","INSTRUCCIONES: Insertar los datos en las casillas grises. Los datos elaborados aparecen en las casillas de color verde.",null,"mm","mm"]
[null,{"$f":"CONCATENATE(IF(A4=1,\" \",\"\"),C4)","v":"Altitude a.s.l."},"Altitude a.s.l.","Altitudine s.l.m.","Altitude a.s.l.","Altitude a.s.l","Höhe ü.d.M.","Altitud s.n.m.",null,"g/kg","g/kg"]
[null,"Altitude error","Altitude error","Errore altitudine","Altitude error","Erreur altitude","Fehler Höheneingabe","Error altitud",null,"m/sec","m/sec"]
[null,{"$f":"CONCATENATE(IF(A6=1,\" \",\"\"),C6)","v":"External Air"},"External Air","Aria esterna","External Air",null,null,"Aire en la entrada",null,"°C","°C"]
[null,"Air after the humidifier","Air after the humidifier","Aria in uscita","Air after the humidifier","Air après humidification","Luft nach dem Befeuchter","Aire en la salida",null,"m^3/h","m^3/h"]
[null,"m","m","m","m","m","m","m",null,"kg/h","kg/h"]
[null,"Relative humidity","Relative humidity","Umidità relativa","Relative humidity","Hygrométrie relative","relative Feuchte","Humedad relativa",null,"bar","bar"]
[null,"Temperature","Temperature","Temperatura","Temperature","Température","Temperatur","Temperatura",null,"Hz","Hz"]
[null,"Specific humidity","Specific humidity","Umidità specifica","Specific humidity","Hygrométrie spécifique","absolute Feuchte","Humedad específica",null,"RPM","PRM"]
[null,"Difference x2-x1","Difference x2-x1","Delta x2-x1","Difference x2-x1","Différence x2-x1","Differenz x2-x1","Delta x2-x1",null,"rH","rH"]
[null,"The following diagram shows the isothermal transformation in red. Blue lines represent curves at a fixed relative humidity, while cyan ones are constant-enthalpy curves.","The following diagram shows the isothermal transformation in red. Blue lines represent curves at a fixed relative humidity, while cyan ones are constant-enthalpy curves.","Nel diagramma successivo è rappresentata in rosso la trasformazione isotermica scelta. In azzurro sono rappresentate le curve isoentalpiche mentre in blu sono riportate quelle ad umidità relativa costante.","The following diagram shows the isothermal transformation in red. Blue lines represent curves at a fixed relative humidity, while cyan ones are constant-enthalpy curves.","Le schéma suivant présente les transformations adiabatiques en rouge. Les lignes bleues représentent les courbes à humidité relative constante, les lignes cyans, les courbes à enthalpie constante.","Das folgende Diagramm wird die Enthalpie-Veränderung durch die adiabate Befeuchtung in roter Farbe dargstellt. Die blauen Linien zeigen die relative Luftfeuchte an und Cyan gibt die konstante Enthalpien an.","En el siguiente diagrama se representa en rojo la transformación isotérmica seleccionada. En azul se representan las curvas isentálpicas mientras que en celeste se muestran las de humedad relativa constante."]
[null,"Duct","Duct","Condotta","Duct","Gaine","Kanal","Conducto"]
[null,"Internal width C1","Internal width C1","Larghezza interna C1","Internal width C1","Largeur interne C1","Innere Kanalbreite C1","Anchura interna C1"]
[null,"Internal height C2","Internal height C2","Altezza interna C2","Internal height C2","Hauteur interne C2","Innere Kanalhöhe C2","Altura interna C2"]
[null,"Percentage of recirculation air","Percentage of recirculation air","Percentuale di aria ricircolata","Percentage of recirculation air","Percentage of recirculation air","Percentage of recirculation air","Percentual de aire recirculada"]
[null,{"$f":"CONCATENATE(IF(A18=1,\" \",\"\"),C18)","v":"Air flow V"},"Air flow V","Portata oraria V","Air flow V","Débit d'air V","Luftvolumenstrom V","Producción horaria V"]
[null,"Air flow GA","Air flow GA","Portata oraria GA","Air flow GA","Débit d'air GA","Muftmassenstrom m","Producción horaria GA"]
[null,"Air speed","Air speed","Velocità dell'aria","Air speed","Vitesse d'air","Luftgeschwindigkeit","Velocidad del aire"]
[null,"Total water flow Gw","Total water flow Gw","Acqua totale Gw","Total water flow Gw","Débit total d'eau Gw","Gesamt-Wassermenge","Agua total Gw"]
[null,"Internal width too small","Internal width too small","Larghezza della condotta insufficiente!","Internal width too small","Largeur interne trop courte","Innere Kanalbreite C1 zu klein","¡Anchura del conducto insuficiente!"]
[null,"Internal height too small","Internal height too small","Altezza della condotta insufficiente!","Internal height too small","Hauteur interne trop courte","Innere Kanalhöhe C2 zu klein","¡Altura del conducto insuficiente!"]
[null,"Error","Error","Errore","Error","Erreur","Fehler","Error"]
[null,"Active probe for ducts","Active probe for ducts","Sonde attive per condotta","Active probe for ducts","Sonde active pour gaine","aktiver Kanalfühler","Sondas activas para conducto"]
[null,"Quantity","Quantity","Quantità","Quantity","Quantité","Anzahl","Cantidad"]
[null,"Code","Code","Codice","Code","Code","Code","Código"]
[null,"Description","Description","Descrizione","Description","Description","Beschreibung","Descripción"]
[null,"List price","List price","Prezzo di listino","List price","Prix de liste","Listenpreis","Precio de lista"]
[null,"TOTAL","TOTAL","TOTALE","TOTAL","TOTAL","GESAMT","TOTAL"]
[null,"Do you want it? (Yes or No)?","Do you want it? (Yes or No)?","Lo si vuole (Si o No)?","Do you want it? (Yes or No)?","Voulez-vous? (Oui ou Non)?","Gewünscht? (Ja oder Nein)","¿Lo desea (Si o No)?"]
[1," Yes/No?","Yes/No?","Si/No?","Yes/No?","Oui/Non?","(Ja/Nein)","¿Si/No?"]
[null,"Total list price","Total list price","Totale prezzo di listino","Total list price","Total prix liste","Gesamt Listenpreis","Total precio de lista"]
[null,"Yes","Yes","Si","Yes","Oui?","Ja","Si"]
[null,"No","No","No","No","Non","Nein","No"]
[null,"Discount","Discount","Sconto","Discount","Remise","Rabatt","Descuento"]
[null,"Temperature probe (0-50 °C) and humidity (10-90% rH)","Temperature probe (0-50 °C) and humidity (10-90% rH)","Sonda di temperatura (0..50 °C) e di umidità (10..90% rH)","Temperature probe (0-50 °C) and humidity (10-90% rH)","Sonde de température (0-50°C) et humidité (10-90% rH)","Temperatur- (0-50°C) und Feuchtefühler (10-90% r.F.)","Sonda de temperatura (0..50 °C) y de humedad (10..90% HR)"]
[null,"Temperature probe (-10-70 °C) and humidity (0-100% rH)","Temperature probe (-10-70 °C) and humidity (0-100% rH)","Sonda di temperatura (-10..70 °C) e di umidità (0..100% rH)","Temperature probe (-10-70 °C) and humidity (0-100% rH)","Sonde de température (-10-70°C) et humidité (0-100% rH)","Temperatur- (-10-50°C) und Feuchtefühler (0-100% r.F.)","Sonda de temperatura (-10..70 °C) y de humedad (0..100% HR)"]
[null,"Humidity probe 10-90% rH","Humidity probe 10-90% rH","Sonda d'umidità 10..90% rH","Humidity probe 10-90% rH","Sonde d'hygrométrie 10-90% rH","Feuchtefühler (10-90% r.F.)","Sonda de humedad 10..90% HR"]
[null,"Humidity probe 0-100% rH","Humidity probe 0-100% rH","Sonda d'umidità 0..100% rH","Humidity probe 0-100% rH","Sonde d'hygrométrie 0-100% rH","Feuchtefühler (0-100% r.F.)","Sonda de humedad 0..100% HR"]
[null,"Position","Position","Posizione","Position","Position","Position","Posición"]
[null,"Code","Code","Articolo","Code","Code","Code","Artículo"]
[null,"Price","Price","Prezzo","Price","Prix","Preis","Precio"]
[null,"Humidifier","Humidifier","Umidificatore","Humidifier","Humidificateur","Befeuchter","Humidificador"]
[null,"Steam distributor","Steam distributor","Distributore di vapore","Steam distributor","Rampe de distributeur de vapeur","Dampfverteiler","Distribuidor de vapor"]
[null,"Steam hose","Steam hose","Tubo trasporto vapore","Steam hose","Flexible vapeur","Dampfschlauch","Tubo de transporte de vapor"]
[null,"Drain hose","Drain hose","Tubo scarico condensa","Drain hose","Flexible condensas","Ablaufschlauch","Tubo de vaciado de condensados"]
[null,"Possible solutions","Possible solutions","Soluzioni possibili","Possible solutions","Solution possible","Vorschlag","Soluciones posibles"]
[null,"Humidifier code","Humidifier code","Codice umidificatore","Humidifier code","Code humidificateur","Bezeichnung Befeuchter","Código del humidificador"]
[null,"Choice of the humidifier","Choice of the humidifier","Scelta dell'umidificatore","Choice of the humidifier","Choix d'humidificateur","Befeuchterauswahl","Selección del humidificador"]
[null,"Y connection for steam hose","Y connection for steam hose","Raccordo a Y per tubi vapore","Y connection for steam hose","Raccord Y pour flexible vapeur","Y-Verteiler für Dampfschlauch","Racor en Y para tubos de vapor"]
[null,"Number of humidifiers","Number of humidifiers","N° di umidificatori","Number of humidifiers","Nombre de humidificateurs","Anzahl der Luftbefeuchter","Nº de humidificadores"]
[null,"STEP 1","STEP 1","STEP 1","STEP 1","STEP 1","Schritt 1","PASO 1"]
[null,{"$f":"CONCATENATE(IF(A54=1,\" \",\"\"),C54)","v":"STEP 2"},"STEP 2","STEP 2","STEP 2","STEP 2","Schritt 2","PASO 2"]
[null,{"$f":"CONCATENATE(IF(A55=1,\" \",\"\"),C55)","v":"STEP 3"},"STEP 3","STEP 3","STEP 3","STEP 3","Schritt 3","PASO 3"]
[null,{"$f":"CONCATENATE(IF(A56=1,\" \",\"\"),C56)","v":"Go to the \"Selection\" sheet"},"Go to the \"Selection\" sheet","Vai al foglio \"Selection\"","Go to the \"Selection\" sheet","Aller à la feuille de \"Sélection\"","Gehe zum \"Selection\"-Blatt","Ir a la hoja \"Selección\""]
[null,{"$f":"CONCATENATE(IF(A57=1,\" \",\"\"),C57)","v":"No. of distributors in the duct"},"No. of distributors in the duct","N. di distributori in condotta","No. of distributors in the duct","Nbr de rampe dans la gaine","Nummer des Verteilers im Kanal","Nº de distribuidores en conducto"]
[null,"Humidifier capacity (kg/h)","Humidifier capacity (kg/h)","Capacità dell'umidificatore (kg/h)","Humidifier capacity (kg/h)","Capacité de l'humidificateur (kg/h)","Befeuchtungsleistung (kg/h)","Capacidad del humidificador (kg/h)"]
[null,"Max kg/h per distributor","Max kg/h per distributor","Portata max del distributore (kg/h)","Max kg/h per distributor","Débit max par rampe (kg/h)","Maximale Leistung pro Verteiler","Producción máx del distribuidor (kg/h)"]
[null,"Distributor length (mm)","Distributor length (mm)","Lunghezza del distributore (mm)","Distributor length (mm)","Longueur de la rampe (mm)","Länge des Verteilers (mm)","Longitud del distribuidor (mm)"]
[null,"Humidification distance (m)","Humidification distance (m)","Distanza di umidificazione (m)","Humidification distance (m)","Distance d'absorption (mm)","Befeuchtungsstrecke (m)","Distancia de humectación (m)"]
[null,"The humidification distance is calculated using the work of Gundacker ","The humidification distance is calculated using the work of Gundacker ","La distanza di umidificazione è calcolata usando il lavoro di Gundacker","The humidification distance is calculated using the work of Gundacker ","La distance d'absorption est calculée en utilisant le travail de Gundaker","Die Befeuchtungsstrecke wurde nach Gundacker berechnet.","La distancia de humectación se calcula utilizando el trabajo de Gundacker"]
[null,"distributor lenght is bigger than duct width","distributor lenght is bigger than duct width","distributor lenght is bigger than duct width","distributor lenght is bigger than duct width","La longueur de la rampe est plus grande que la largeur de la gaine","Die Dampflanze ist länger als die Kanalbreite!","La longitud del distribuidor es mayor que la anchura del conducto"]
[null,"humidification load is bigger than maximum steam distributor capacity","humidification load is bigger than maximum steam distributor capacity","humidification load is bigger than maximum steam distributor capacity","humidification load is bigger than maximum steam distributor capacity","Le débit de vapeur de l'humidificateur est plus grand que la capacité maximum des rampes","Die Befeuchtungsleistung ist zu groß um sie mit der längsten Dampflanze in die Luft einzubringen.","La carga de humectación es mayor que la capacidad máxima del distribuidor de vapor"]
[null,"Voltage not available for the model chosen","Voltage not available for the model chosen","Tensione non disponibile per il modello di umidificatore scelto","Voltage not available for the model chosen","Tension non disponible pour le modèle choisi","Spannung nicht verfügbar für das gewählte Modell","Tensión no disponible para el modelo de humidificador seleccionado"]
[null,"Option not correct for the model chosen","Option not correct for the model chosen","Optional non corretto per il modello di umidificatore scelto","Option not correct for the model chosen","Option pas correct pour le modèle choisi","Option nicht richtig für das Modell gewählt","Opción incorrecta para el modelo de humidificador seleccionado"]
[null,"Disposable cylinder (humiSteam only)","Disposable cylinder (humiSteam only)","Cilindro standard (solo per humiSteam)","Disposable cylinder (humiSteam only)","Cylindre non ouvrant (UE seulement)","Einweg-Dampfzylinder (nur UE)","Cilindro standard (sólo para humiSteam)"]
[null,"Cleanable cylinder (humiSteam only)","Cleanable cylinder (humiSteam only)","Cilindro apribile (solo per humiSteam)","Cleanable cylinder (humiSteam only)","Cylindre ouvrant (UE seulement)","Reinigungsfähig-Dampfzylinder (nur UE)","Cilindro practicable (sólo para humiSteam)"]
[null,"heaterSteam process","heaterSteam process","heaterSteam process","heaterSteam process","heaterSteam process","heaterSteam process","heaterSteam process"]
[null,"heaterSteam Titanium","heaterSteam Titanium","heaterSteam Titanium","heaterSteam Titanium","heaterSteam Titanium","heaterSteam Titanium","heaterSteam Titanium"]
[null,"Pump 50 hz (gaSteam only)","Pump 50 hz (gaSteam only)","Pompa 50 Hz (solo per gaSteam)","Pump 50 hz (gaSteam only)","Pump 50 hz (gaSteam only)","Pump 50 hz (gaSteam only)","Pump 50 hz (gaSteam only)"]
[null,"Pump 60 Hz (USA Market) (gaSteam only)","Pump 60 Hz (USA Market) (gaSteam only)","Pompa 60 Hz (Mercato usa) (Solo per gaSteam)","Pump 60 Hz (USA Market) (gaSteam only)","Pump 60 Hz (USA Market) (gaSteam only)","Pump 60 Hz (USA Market) (gaSteam only)","Pump 60 Hz (USA Market) (gaSteam only)"]
[null,"Voltage specification","Voltage specification","Scelta della tensione","Voltage specification","Tension spécification","Spannung Spezifikation","Selección de la tensión"]
[null,"Options specification","Options specification","Scelta delle caratteristiche opzionali","Options specification","Options spécification","Optionen Spezifikation","Selección de las características opcionales"]
[null,"capacity of humidifier is less than the requested load","capacity of humidifier is less than the requested load","capacity of humidifier is less than the requested load","capacity of humidifier is less than the requested load","capacity of humidifier is less than the requested load","capacity of humidifier is less than the requested load","capacity of humidifier is less than the requested load"]
[null,"Codice","English description","Descrizione italiana","English description","Description en français","Deutsche Version","Descripción italiana"]
[null,"DP035D22R0","Stainless steel steam distributor, inlet  Ø=22 mm, l = 350 mm","Distributore di vapore inox, ingresso Ø=22 mm, L = 350 mm","Stainless steel steam distributor, inlet  Ø=22 mm, l = 350 mm","Rampe distribution de vapeur Inox, int. Ø=22 mm, l = 350 mm","Edelstahl-Dampflanze, Anschluss Dampfschlauch  Ø=22 mm, l = 350 mm","Distribuidor de vapor inox, entrada Ø=22 mm, L = 350 mm"]
[null,"DP045D22R0","Stainless steel steam distributor, inlet  Ø=22 mm, l = 450 mm","Distributore di vapore inox, ingresso Ø=22 mm, L = 450 mm","Stainless steel steam distributor, inlet  Ø=22 mm, l = 450 mm","Rampe distribution de vapeur Inox, int. Ø=22 mm, l = 450 mm","Edelstahl-Dampflanze, Anschluss Dampfschlauch  Ø=22 mm, l = 450 mm","Distribuidor de vapor inox, entrada Ø=22 mm, L = 450 mm"]
[null,"DP060D22R0","Stainless steel steam distributor, inlet  Ø=22 mm, l = 600 mm","Distributore di vapore inox, ingresso Ø=22 mm, L = 600 mm","Stainless steel steam distributor, inlet  Ø=22 mm, l = 600 mm","Rampe distribution de vapeur Inox, int. Ø=22 mm, l = 600 mm","Edelstahl-Dampflanze, Anschluss Dampfschlauch  Ø=22 mm, l = 600 mm","Distribuidor de vapor inox, entrada Ø=22 mm, L = 600 mm"]
[null,"DP085D22R0","Stainless steel steam distributor, inlet  Ø=22 mm, l = 850 mm","Distributore di vapore inox, ingresso Ø=22 mm, L = 850 mm","Stainless steel steam distributor, inlet  Ø=22 mm, l = 850 mm","Rampe distribution de vapeur Inox, int.  Ø=22 mm, l = 850 mm","Edelstahl-Dampflanze, Anschluss Dampfschlauch  Ø=22 mm, l = 850 mm","Distribuidor de vapor inox, entrada Ø=22 mm, L = 850 mm"]
[null,"DP035D30R0","Stainless steel steam distributor, inlet  Ø=30 mm, l = 350 mm","Distributore di vapore inox, ingresso Ø=30 mm, L = 350 mm","Stainless steel steam distributor, inlet  Ø=30 mm, l = 350 mm","Rampe distribution de vapeur Inox, int.  Ø=30 mm, l = 350 mm","Edelstahl-Dampflanze, Anschluss Dampfschlauch  Ø=30 mm, l = 350 mm","Distribuidor de vapor inox, entrada Ø=30 mm, L = 350 mm"]
[null,"DP045D30R0","Stainless steel steam distributor, inlet  Ø=30 mm, l = 450 mm","Distributore di vapore inox, ingresso Ø=30 mm, L = 450 mm","Stainless steel steam distributor, inlet  Ø=30 mm, l = 450 mm","Rampe distribution de vapeur Inox, int.  Ø=30 mm, l = 450 mm","Edelstahl-Dampflanze, Anschluss Dampfschlauch  Ø=30 mm, l = 450 mm","Distribuidor de vapor inox, entrada Ø=30 mm, L = 450 mm"]
[null,"DP060D30R0","Stainless steel steam distributor, inlet  Ø=30 mm, l = 600 mm","Distributore di vapore inox, ingresso Ø=30 mm, L = 600 mm","Stainless steel steam distributor, inlet  Ø=30 mm, l = 600 mm","Rampe distribution de vapeur Inox, int.  Ø=30 mm, l = 600 mm","Edelstahl-Dampflanze, Anschluss Dampfschlauch  Ø=30 mm, l = 600 mm","Distribuidor de vapor inox, entrada Ø=30 mm, L = 600 mm"]
[null,"DP085D30R0","Stainless steel steam distributor, inlet  Ø=30 mm, l = 850 mm","Distributore di vapore inox, ingresso Ø=30 mm, L = 850 mm","Stainless steel steam distributor, inlet  Ø=30 mm, l = 850 mm","Rampe distribution de vapeur Inox, int.  Ø=30 mm, l = 850 mm","Edelstahl-Dampflanze, Anschluss Dampfschlauch  Ø=30 mm, l = 850 mm","Distribuidor de vapor inox, entrada Ø=30 mm, L = 850 mm"]
[null,"DP105D30R0","Stainless steel steam distributor, inlet  Ø=30 mm, l = 1,050 mm","Distributore di vapore inox, ingresso Ø=30 mm, L = 1.050 mm","Stainless steel steam distributor, inlet  Ø=30 mm, l = 1,050 mm","Rampe distribution de vapeur Inox, int.  Ø=30 mm, l = 1,050 mm","Edelstahl-Dampflanze, Anschluss Dampfschlauch  Ø=30 mm, l = 1,050 mm","Distribuidor de vapor inox, entrada Ø=30 mm, L = 1.050 mm"]
[null,"DP125D30R0","Stainless steel steam distributor, inlet  Ø=30 mm, l = 1,250 mm","Distributore di vapore inox, ingresso Ø=30 mm, L = 1.250 mm","Stainless steel steam distributor, inlet  Ø=30 mm, l = 1,250 mm","Rampe distribution de vapeur Inox, int.  Ø=30 mm, l = 1,250 mm","Edelstahl-Dampflanze, Anschluss Dampfschlauch  Ø=30 mm, l = 1,250 mm","Distribuidor de vapor inox, entrada Ø=30 mm, L = 1.250 mm"]
[null,"DP165D30R0","Stainless steel steam distributor, inlet  Ø=30 mm, l = 1.650 mm","Distributore di vapore inox, ingresso Ø=30 mm, L = 1.650 mm","Stainless steel steam distributor, inlet  Ø=30 mm, l = 1.650 mm","Rampe distribution de vapeur Inox, int.  Ø=30 mm, l = 1.650 mm","Edelstahl-Dampflanze, Anschluss Dampfschlauch  Ø=30 mm, l = 1.650 mm","Distribuidor de vapor inox, entrada Ø=30 mm, L = 1.650 mm"]
[null,"DP085D40R0","Stainless steel steam distributor, inlet  Ø=40 mm, l = 850 mm","Distributore di vapore inox, ingresso Ø=40 mm, L = 850 mm","Stainless steel steam distributor, inlet  Ø=40 mm, l = 850 mm","Rampe distribution de vapeur Inox, int.  Ø=40 mm, l = 850 mm","Edelstahl-Dampflanze, Anschluss Dampfschlauch  Ø=40 mm, l = 850 mm","Distribuidor de vapor inox, entrada Ø=40 mm, L = 850 mm"]
[null,"DP105D40R0","Stainless steel steam distributor, inlet  Ø=40 mm, l = 1,050 mm","Distributore di vapore inox, ingresso Ø=40 mm, L = 1.050 mm","Stainless steel steam distributor, inlet  Ø=40 mm, l = 1,050 mm","Rampe distribution de vapeur Inox, int.  Ø=40 mm, l = 1,050 mm","Edelstahl-Dampflanze, Anschluss Dampfschlauch  Ø=40 mm, l = 1,050 mm","Distribuidor de vapor inox, entrada Ø=40 mm, L = 1.050 mm"]
[null,"DP125D40R0","Stainless steel steam distributor, inlet  Ø=40 mm, l = 1,250 mm","Distributore di vapore inox, ingresso Ø=40 mm, L = 1.250 mm","Stainless steel steam distributor, inlet  Ø=40 mm, l = 1,250 mm","Rampe distribution de vapeur Inox, int.  Ø=40 mm, l = 1,250 mm","Edelstahl-Dampflanze, Anschluss Dampfschlauch  Ø=40 mm, l = 1,250 mm","Distribuidor de vapor inox, entrada Ø=40 mm, L = 1.250 mm"]
[null,"DP165D40R0","Stainless steel steam distributor, inlet  Ø=40 mm, l = 1,650 mm","Distributore di vapore inox, ingresso Ø=40 mm, L = 1.650 mm","Stainless steel steam distributor, inlet  Ø=40 mm, l = 1,650 mm","Rampe distribution de vapeur Inox, int.  Ø=40 mm, l = 1,650 mm","Edelstahl-Dampflanze, Anschluss Dampfschlauch  Ø=40 mm, l = 1,650 mm","Distribuidor de vapor inox, entrada Ø=40 mm, L = 1.650 mm"]
[null,"DP205D40R0","Stainless steel steam distributor, inlet  Ø=40 mm, l = 2,050 mm","Distributore di vapore inox, ingresso Ø=40 mm, L = 2.050 mm","Stainless steel steam distributor, inlet  Ø=40 mm, l = 2,050 mm","Rampe distribution de vapeur Inox, int.  Ø=40 mm, l = 2,050 mm","Edelstahl-Dampflanze, Anschluss Dampfschlauch  Ø=40 mm, l = 2,050 mm","Distribuidor de vapor inox, entrada Ø=40 mm, L = 2.050 mm"]
[null,"DP030D22RU","Stainless steel steam distributor, inlet Ø=22 mm, l = 300 mm","Distributore di vapore inox, ingresso Ø=22 mm, L = 300 mm","Stainless steel steam distributor, inlet Ø=22 mm, l = 300 mm","Rampe distribution de vapeur Inox, int. Ø=22 mm, l = 300 mm","Edelstahl-Dampflanze, Anschluss Dampfschlauch Ø=22 mm, l = 300 mm","Distribuidor de vapor inox, entrada Ø=22 mm, L = 300 mm"]
[null,"DP030D30RU","Stainless steel steam distributor, inlet  Ø=30 mm, l = 300 mm","Distributore di vapore inox, ingresso Ø=30 mm, L = 300 mm","Stainless steel steam distributor, inlet  Ø=30 mm, l = 300 mm","Rampe distribution de vapeur Inox, int.  Ø=30 mm, l = 300 mm","Edelstahl-Dampflanze, Anschluss Dampfschlauch  Ø=30 mm, l = 300 mm","Distribuidor de vapor inox, entrada Ø=30 mm, L = 300 mm"]
[null,"DP045D30RU","Stainless steel steam distributor, inlet  Ø=30 mm, l = 450 mm","Distributore di vapore inox, ingresso Ø=30 mm, L = 450 mm","Stainless steel steam distributor, inlet  Ø=30 mm, l = 450 mm","Rampe distribution de vapeur Inox, int.  Ø=30 mm, l = 450 mm","Edelstahl-Dampflanze, Anschluss Dampfschlauch  Ø=30 mm, l = 450 mm","Distribuidor de vapor inox, entrada Ø=30 mm, L = 450 mm"]
[null,"DP060D30RU","Stainless steel steam distributor, inlet  Ø=30 mm, l = 600 mm","Distributore di vapore inox, ingresso Ø=30 mm, L = 600 mm","Stainless steel steam distributor, inlet  Ø=30 mm, l = 600 mm","Rampe distribution de vapeur Inox, int.  Ø=30 mm, l = 600 mm","Edelstahl-Dampflanze, Anschluss Dampfschlauch  Ø=30 mm, l = 600 mm","Distribuidor de vapor inox, entrada Ø=30 mm, L = 600 mm"]
[null,"DP060D40RU","Stainless steel steam distributor, inlet  Ø=40 mm, l = 600 mm","Distributore di vapore inox, ingresso Ø=40 mm, L = 600 mm","Stainless steel steam distributor, inlet  Ø=40 mm, l = 600 mm","Rampe distribution de vapeur Inox, int.  Ø=40 mm, l = 600 mm","Edelstahl-Dampflanze, Anschluss Dampfschlauch  Ø=40 mm, l = 600 mm","Distribuidor de vapor inox, entrada Ø=40 mm, L = 600 mm"]
[null,"SDPOEM0012","SDP OEM: steam injection nozzle up to 3 kg/h","SDP OEM: ugello vapore fino a 3 kg/h","SDP OEM: steam injection nozzle up to 3 kg/h","SDP OEM: buse injection de vapeur jusqu'à 3 kg/h","SDP OEM: Dampfdüse bis 3 kg/h","SDP OEM: boquilla de vapor hasta 3 kg/h"]
[null,"SDPOEM0022","SDP OEM: steam injection nozzle from 3 to 15 kg/h","SDP OEM ugello vapore da 3 fino a 18 kg/h","SDP OEM: steam injection nozzle from 3 to 15 kg/h","SDP OEM: buse injection de vapeur de 3 à 15 kg/h","SDP OEM: Dampfdüse von 3 bis 15 kg/h","SDP OEM boquilla de vapor de 3 a 18 kg/h"]
[null,"SDPOEM0000","SDP OEM: customizable steam injection nozzle","SDP OEM ugello vapore non forato","SDP OEM: customizable steam injection nozzle","SDP OEM: buse injection de vapeur non percée","SDP OEM: anpassbare Dampfdüse","SDP OEM boquilla de vapor no agujereada"]
[null,"UEKY000000","‘Y’ connector for steam hoses (from 1x Ø=40 mm to 2x Ø=30 mm)","Raccordo a Y per tubi vapore (da 1x Ø=40 mm a 2x Ø=30 mm)","‘Y’ connector for steam hoses (from 1x Ø=40 mm to 2x Ø=30 mm)","Raccord ‘Y’ pour flexible vapeur (de 1x Ø=40 mm à 2x Ø=30 mm)","‘Y’ -Verteiler für Dampfschläuche (von 1x Ø=40 mm auf 2x Ø=30 mm)","Racor en Y para tubos de vapor (desde 1x Ø=40 mm hasta 2x Ø=30 mm)"]
[null,"UEKY40X400","‘Y’ connector for steam hoses (from 1x Ø=40 mm to 2x Ø=40 mm)","Raccordo a Y per tubi vapore (da 1x Ø=40 mm a 2x Ø=40 mm)","‘Y’ connector for steam hoses (from 1x Ø=40 mm to 2x Ø=40 mm)","Raccord ‘Y’ pour flexible vapeur (de 1x Ø=40 mm à 2x Ø=40 mm)","‘Y’ -Verteiler für Dampfschläuche (von 1x Ø=40 mm auf 2x Ø=40 mm)","Racor en Y para tubos de vapor (desde 1x Ø=40 mm hasta 2x Ø=40 mm)"]
[null,"1312360AXX","Steam hose with steel spring Ø=22 mm (per metre)","Tubo trasporto vapore con spirale acciaio Ø=22 mm (al metro)","Steam hose with steel spring Ø=22 mm (per metre)","Flexible vapeur renforcé Ø=22 mm (par mètre)","Dampfschlauch mit integrierter Stahlfeder Ø=22 mm (pro Meter)","Tubo de transporte de vapor con espiral de acero Ø=22 mm (el metro)"]
[null,"1312365AXX","Steam hose with steel spring Ø=30 mm (per meter)","Tubo trasporto vapore con spirale acciaio Ø=30 mm (al metro)","Steam hose with steel spring Ø=30 mm (per meter)","Flexible vapeur renforcé Ø=30 mm (par mètre)","Dampfschlauch mit integrierter Stahlfeder Ø=30 mm (pro Meter)","Tubo de transporte de vapor con espiral de acero Ø=30 mm (el metro)"]
[null,"1312367AXX","Steam hose with steel spring Ø=40 mm (per metre)","Tubo trasporto vapore con spirale acciaio Ø=40 mm (al metro)","Steam hose with steel spring Ø=40 mm (per metre)","Flexible vapeur renforcé Ø=40 mm (par mètre)","Dampfschlauch mit integrierter Stahlfeder Ø=40 mm (pro Meter)","Tubo de transporte de vapor con espiral de acero Ø=40 mm (el metro)"]
[null,"FWH3415003","Water fill hose l = 1.5 m with 3/4” fitting ","Tubo carico acqua l = 1,5 m con connessione 3/4” ","Water fill hose l = 1.5 m with 3/4” fitting ","Flexible alimentation eau l = 1.5 m avec raccord 3/4”  ","Wasser-Anschluss-Schlauch l = 1.5 m mit 3/4” Muffe ","Tubo de llenado de agua l = 1,5 m con conexión 3/4” "]
[null,"FWH3430003","Water fill hose l = 3 m with 3/4” fitting ","Tubo carico acqua l = 3 m con connessione 3/4” ","Water fill hose l = 3 m with 3/4” fitting ","Flexible alimentation eau l = 3 m avec raccord 3/4”  ","Wasser-Anschluss-Schlauch l = 3 m mit 3/4” Muffe ","Tubo de llenado de agua l = 3 m con conexión 3/4” "]
[null,"FWHDCV0003","Water fill hose with dual-check valve (included from UE065 to UE130)","Tubo carico acqua con valvola antiritorno (incluso da UE065 a UE130)","Water fill hose with dual-check valve (included from UE065 to UE130)","Flexible alimentation eau avec clapet (inclus sur UE065 à UE130)","Wasser-Anschluss-Schlauch mit Doppel-Rückschlagventil (beim UE065 bis UE130 im Lieferumfang enthalten)","Tubo de llenado de agua con válvula antiretorno (incluso de UE065 a UE130)"]
[null,"1312353APG","SFC 006: condensate drain hose Ø=7 mm (per metre)","SFC 006: tubo per scarico condensa Ø=7 mm (al metro) per testate ventilanti e ugelli SDPOEM00**","SFC 006: condensate drain hose Ø=7 mm (per metre)","SFC 006: flexible condensas Ø=7 mm (par mètre)","SFC 006: Kondensatablauf Schlauch Ø=7 mm (pro Meter)","SFC 006: tubo para vaciado condensado Ø=7 mm (el metro) para cabezales ventiladores y boquillas SDPOEM00**"]
[null,"1312368AXX","condensate drain hose Ø=10 mm (per metre)","tubo per scarico condensa Ø=10 mm (al metro) per distributori di vapore DP***D**R*","condensate drain hose Ø=10 mm (per metre)","flexible condensas Ø=10 mm (par mètre)","Kondensatablauf Schlauch Ø=10 mm (pro Meter)","Tubo para vaciado condensado Ø=10 mm (el metro) para distribuidores de vapor DP***D**R*"]
[null,"DPWC112000","Active wall mounting sensor: Temperature (-10T60 °C) and humidity (10 to 90% rH)","Sonda attiva per ambiente: temperatura (-10T60 °C) ed umidità (10…90% rH)","Active wall mounting sensor: Temperature (-10T60 °C) and humidity (10 to 90% rH)","Active wall mounting sensor: Temperature (-10T60 °C) and humidity (10 to 90% rH)","Raumfüheler für Temperatur (-10T60 °C) und Feuchte (10-90% r.F.)","Sonda activa para ambiente: temperatura (-10T60 °C) y humedad (10…90% rH)"]
[null,"DPPC112000","Active sensor for industrial environments: Temperature (-20T70 °C) and humidity (10 to 90% rH)","Sonda attiva per ambiente industriale: Temperatura (-20T70 °C) ed umidità (10…90% rH)","Active sensor for industrial environments: Temperature (-20T70 °C) and humidity (10 to 90% rH)","Active sensor for industrial environments: Temperature (-20T70 °C) and humidity (10 to 90% rH)","Wandfüheler für Temperatur (-20T70 °C) und Feuchte (10-90% r.F.)","Sonda activa para ambiente industrial: temperatura (-20T70 °C) y humedad (10…90% rH)"]
[null,"DPPC212000","Active sensor for industrial environments: Temperature (-20T70 °C) and humidity (0 to 100% rH)","Sonda attiva per ambiente industriale: Temperatura (-20T70 °C) ed umidità (0…100% rH)","Active sensor for industrial environments: Temperature (-20T70 °C) and humidity (0 to 100% rH)","Active sensor for industrial environments: Temperature (-20T70 °C) and humidity (0 to 100% rH)","Wandfüheler für Temperatur (-20T70 °C) und Feuchte (0-100% r.F.)","Sonda activa para ambiente industrial: temperatura (-20T70 °C) y humedad (0…100% rH)"]
[null,"DPDC112000","Active sensor for ducts: Temperature (-20T70 °C) and humidity (10 to 90% rH)","Sonda attiva per condotta: Temperatura (-20T70 °C) ed umidità (10…90% rH)","Active sensor for ducts: Temperature (-20T70 °C) and humidity (10 to 90% rH)","Active sensor for ducts: Temperature (-20T70 °C) and humidity (10 to 90% rH)","Kanalfüheler für Temperatur (-20T70 °C) und Feuchte (10-90% r.F.)","Sonda activa para conducto: temperatura (-20T70 °C) y humedad (10…90% rH)"]
[null,"DPDC212000","Active sensor for ducts: Temperature (-20T70 °C) and humidity (0 to 100% rH)","Sonda attiva per condotta: Temperatura (-20T70 °C) ed umidità (0…100% rH)","Active sensor for ducts: Temperature (-20T70 °C) and humidity (0 to 100% rH)","Active sensor for ducts: Temperature (-20T70 °C) and humidity (0 to 100% rH)","Kanalfüheler für Temperatur (-20T70 °C) und Feuchte (0-100% r.F.)","Sonda activa para conducto: temperatura (-20T70 °C) y humedad (0…100% rH)"]
[null,"ASET030001","Temperature probe (-30T90 °C) for universal use","Sonda di temperatura (-30T90 °C) per uso universale ","Temperature probe (-30T90 °C) for universal use","Temperature probe (-30T90 °C) for universal use","Temperaturfüheler (-30T90 °C) ","Sonda de temperatura (-30T90 °C) para uso universal "]
[null,"UE001YD001","humiSteam Basic 1,5 kg/h, 230V 1~, ON/OFF or proportional, disposable cylinder","humiSteam Basic 1,5 kg/h, 230V 1~, ON/OFF o proporzionale, cilindro non apribile","humiSteam Basic 1,5 kg/h, 230V 1~, ON/OFF or proportional, disposable cylinder","humiSteam Basic 1,5 kg/h, 230V 1~, ON/OFF ou proportionnel, cylindre non ouvrant","humiSteam Basic 1,5 kg/h, 230V 1~, EIN/AUS-Betrieb oder proportional Regelung, Einweg-Dampfzylinder","humiSteam Basic 1,5 kg/h, 230V 1~, todo/nada o proporcional, cilindro no practicable"]
[null,"UE001YDC01","humiSteam Basic 1,5 kg/h, 230V 1~, ON/OFF or proportional, cleanable cylinder","humiSteam Basic 1,5 kg/h, 230V 1~, ON/OFF o proporzionale, cilindro apribile","humiSteam Basic 1,5 kg/h, 230V 1~, ON/OFF or proportional, cleanable cylinder","humiSteam Basic 1,5 kg/h, 230V 1~, ON/OFF ou proportionnel, cylindre ouvrant","humiSteam Basic 1,5 kg/h, 230V 1~, EIN/AUS-Betrieb oder proportional Regelung, Reinigungsfähig-Dampfzylinder","humiSteam Basic 1,5 kg/h, 230V 1~, todo/nada o proporcional, cilindro practicable"]
[null,"UE001YU001","humiSteam Basic 1,5 kg/h, 208V 1~, ON/OFF or proportional, disposable cylinder","humiSteam Basic 1,5 kg/h, 208V 1~, ON/OFF o proporzionale, cilindro non apribile","humiSteam Basic 1,5 kg/h, 208V 1~, ON/OFF or proportional, disposable cylinder","humiSteam Basic 1,5 kg/h, 208V 1~, ON/OFF ou proportionnel, cylindre non ouvrant","humiSteam Basic 1,5 kg/h, 208V 1~, EIN/AUS-Betrieb oder proportional Regelung, Einweg-Dampfzylinder","humiSteam Basic 1,5 kg/h, 208V 1~, todo/nada o proporcional, cilindro no practicable"]
[null,"UE001YUC01","humiSteam Basic 1,5 kg/h, 208V 1~, ON/OFF or proportional, cleanable cylinder","humiSteam Basic 1,5 kg/h, 208V 1~, ON/OFF o proporzionale, cilindro apribile","humiSteam Basic 1,5 kg/h, 208V 1~, ON/OFF or proportional, cleanable cylinder","humiSteam Basic 1,5 kg/h, 208V 1~, ON/OFF ou proportionnel, cylindre ouvrant","humiSteam Basic 1,5 kg/h, 208V 1~, EIN/AUS-Betrieb oder proportional Regelung, Reinigungsfähig-Dampfzylinder","humiSteam Basic 1,5 kg/h, 208V 1~, todo/nada o proporcional, cilindro practicable"]
[null,"UE003YD001","humiSteam Basic 3 kg/h, 230V 1~, ON/OFF or proportional, disposable cylinder","humiSteam Basic 3 kg/h, 230V 1~, ON/OFF o proporzionale, cilindro non apribile","humiSteam Basic 3 kg/h, 230V 1~, ON/OFF or proportional, disposable cylinder","humiSteam Basic 3 kg/h, 230V 1~, ON/OFF ou proportionnel, cylindre non ouvrant","humiSteam Basic 3 kg/h, 230V 1~, EIN/AUS-Betrieb oder proportional Regelung, Einweg-Dampfzylinder","humiSteam Basic 3 kg/h, 230V 1~, todo/nada o proporcional, cilindro no practicable"]
[null,"UE003YDC01","humiSteam Basic 3 kg/h, 230V 1~, ON/OFF or proportional, cleanable cylinder","humiSteam Basic 3 kg/h, 230V 1~, ON/OFF o proporzionale, cilindro apribile","humiSteam Basic 3 kg/h, 230V 1~, ON/OFF or proportional, cleanable cylinder","humiSteam Basic 3 kg/h, 230V 1~, ON/OFF ou proportionnel, cylindre ouvrant","humiSteam Basic 3 kg/h, 230V 1~, EIN/AUS-Betrieb oder proportional Regelung, Reinigungsfähig-Dampfzylinder","humiSteam Basic 3 kg/h, 230V 1~, todo/nada o proporcional, cilindro practicable"]
[null,"UE003YK001","humiSteam Basic 3 kg/h, 230V 3~, ON/OFF or proportional, disposable cylinder","humiSteam Basic 3 kg/h, 230V 3~,  ON/OFF o proporzionale, cilindro non apribile","humiSteam Basic 3 kg/h, 230V 3~, ON/OFF or proportional, disposable cylinder","humiSteam Basic 3 kg/h, 230V 3~, ON/OFF ou proportionnel, cylindre non ouvrant","humiSteam Basic 3 kg/h, 230V 3~, EIN/AUS-Betrieb oder proportional Regelung, Einweg-Dampfzylinder","humiSteam Basic 3 kg/h, 230V 3~,  todo/nada o proporcional, cilindro no practicable"]
[null,"UE003YKC01","humiSteam Basic 3 kg/h, 230V 3~, ON/OFF or proportional, cleanable cylinder","humiSteam Basic 3 kg/h, 230V 3~,  ON/OFF o proporzionale, cilindro apribile","humiSteam Basic 3 kg/h, 230V 3~, ON/OFF or proportional, cleanable cylinder","humiSteam Basic 3 kg/h, 230V 3~, ON/OFF ou proportionnel, cylindre ouvrant","humiSteam Basic 3 kg/h, 230V 3~, EIN/AUS-Betrieb oder proportional Regelung, Reinigungsfähig-Dampfzylinder","humiSteam Basic 3 kg/h, 230V 3~,  todo/nada o proporcional, cilindro practicable"]
[null,"UE003YL001","humiSteam Basic 3 kg/h, 400V 3~, ON/OFF or proportional, disposable cylinder","humiSteam Basic 3 kg/h, 400V 3~,  ON/OFF o proporzionale, cilindro non apribile","humiSteam Basic 3 kg/h, 400V 3~, ON/OFF or proportional, disposable cylinder","humiSteam Basic 3 kg/h, 400V 3~, ON/OFF ou proportionnel, cylindre non ouvrant","humiSteam Basic 3 kg/h, 400V 3~, EIN/AUS-Betrieb oder proportional Regelung, Einweg-Dampfzylinder","humiSteam Basic 3 kg/h, 400V 3~,  todo/nada o proporcional, cilindro no practicable"]
[null,"UE003YLC01","humiSteam Basic 3 kg/h, 400V 3~, ON/OFF or proportional, cleanable cylinder","humiSteam Basic 3 kg/h, 400V 3~,  ON/OFF o proporzionale, cilindro apribile","humiSteam Basic 3 kg/h, 400V 3~, ON/OFF or proportional, cleanable cylinder","humiSteam Basic 3 kg/h, 400V 3~, ON/OFF ou proportionnel, cylindre ouvrant","humiSteam Basic 3 kg/h, 400V 3~, EIN/AUS-Betrieb oder proportional Regelung, Reinigungsfähig-Dampfzylinder","humiSteam Basic 3 kg/h, 400V 3~,  todo/nada o proporcional, cilindro practicable"]
[null,"UE003YM001","humiSteam Basic 3 kg/h, 460V 3~, ON/OFF or proportional, disposable cylinder","humiSteam Basic 3 kg/h, 460V 3~,  ON/OFF o proporzionale, cilindro non apribile","humiSteam Basic 3 kg/h, 460V 3~, ON/OFF or proportional, disposable cylinder","humiSteam Basic 3 kg/h, 460V 3~, ON/OFF ou proportionnel, cylindre non ouvrant","humiSteam Basic 3 kg/h, 460V 3~, EIN/AUS-Betrieb oder proportional Regelung, Einweg-Dampfzylinder","humiSteam Basic 3 kg/h, 460V 3~,  todo/nada o proporcional, cilindro no practicable"]
[null,"UE003YMC01","humiSteam Basic 3 kg/h, 460V 3~, ON/OFF or proportional, cleanable cylinder","humiSteam Basic 3 kg/h, 460V 3~,  ON/OFF o proporzionale, cilindro apribile","humiSteam Basic 3 kg/h, 460V 3~, ON/OFF or proportional, cleanable cylinder","humiSteam Basic 3 kg/h, 460V 3~, ON/OFF ou proportionnel, cylindre ouvrant","humiSteam Basic 3 kg/h, 460V 3~, EIN/AUS-Betrieb oder proportional Regelung, Reinigungsfähig-Dampfzylinder","humiSteam Basic 3 kg/h, 460V 3~,  todo/nada o proporcional, cilindro practicable"]
[{"$nulls":7},"humiSteam Basic 3 kg/h, 575V 3~,  todo/nada o proporcional, cilindro no practicable"]
[{"$nulls":7},"humiSteam Basic 3 kg/h, 575V 3~,  todo/nada o proporcional, cilindro practicable"]
[null,"UE003YU001","humiSteam Basic 3 kg/h, 208V 1~, ON/OFF or proportional, disposable cylinder","humiSteam Basic 3 kg/h, 208V 1~, ON/OFF o proporzionale, cilindro non apribile","humiSteam Basic 3 kg/h, 208V 1~, ON/OFF or proportional, disposable cylinder","humiSteam Basic 3 kg/h, 208V 1~, ON/OFF ou proportionnel, cylindre non ouvrant","humiSteam Basic 3 kg/h, 208V 1~, EIN/AUS-Betrieb oder proportional Regelung, Einweg-Dampfzylinder","humiSteam Basic 3 kg/h, 208V 1~, todo/nada o proporcional, cilindro no practicable"]
[null,"UE003YUC01","humiSteam Basic 3 kg/h, 208V 1~, ON/OFF or proportional, cleanable cylinder","humiSteam Basic 3 kg/h, 208V 1~, ON/OFF o proporzionale, cilindro apribile","humiSteam Basic 3 kg/h, 208V 1~, ON/OFF or proportional, cleanable cylinder","humiSteam Basic 3 kg/h, 208V 1~, ON/OFF ou proportionnel, cylindre ouvrant","humiSteam Basic 3 kg/h, 208V 1~, EIN/AUS-Betrieb oder proportional Regelung, Reinigungsfähig-Dampfzylinder","humiSteam Basic 3 kg/h, 208V 1~, todo/nada o proporcional, cilindro practicable"]
[null,"UE003YW001","humiSteam Basic 3 kg/h, 208V 3~, ON/OFF or proportional, disposable cylinder","humiSteam Basic 3 kg/h, 208V 3~,  ON/OFF o proporzionale, cilindro non apribile","humiSteam Basic 3 kg/h, 208V 3~, ON/OFF or proportional, disposable cylinder","humiSteam Basic 3 kg/h, 208V 3~, ON/OFF ou proportionnel, cylindre non ouvrant","humiSteam Basic 3 kg/h, 208V 3~, EIN/AUS-Betrieb oder proportional Regelung, Einweg-Dampfzylinder","humiSteam Basic 3 kg/h, 208V 3~,  todo/nada o proporcional, cilindro no practicable"]
[null,"UE003YWC01","humiSteam Basic 3 kg/h, 208V 3~, ON/OFF or proportional, cleanable cylinder","humiSteam Basic 3 kg/h, 208V 3~,  ON/OFF o proporzionale, cilindro apribile","humiSteam Basic 3 kg/h, 208V 3~, ON/OFF or proportional, cleanable cylinder","humiSteam Basic 3 kg/h, 208V 3~, ON/OFF ou proportionnel, cylindre ouvrant","humiSteam Basic 3 kg/h, 208V 3~, EIN/AUS-Betrieb oder proportional Regelung, Reinigungsfähig-Dampfzylinder","humiSteam Basic 3 kg/h, 208V 3~,  todo/nada o proporcional, cilindro practicable"]
[null,"UE005YD001","humiSteam Basic 5 kg/h, 230V 1~, ON/OFF or proportional, disposable cylinder","humiSteam Basic 5 kg/h, 230V 1~, ON/OFF o proporzionale, cilindro non apribile","humiSteam Basic 5 kg/h, 230V 1~, ON/OFF or proportional, disposable cylinder","humiSteam Basic 5 kg/h, 230V 1~, ON/OFF ou proportionnel, cylindre non ouvrant","humiSteam Basic 5 kg/h, 230V 1~, EIN/AUS-Betrieb oder proportional Regelung, Einweg-Dampfzylinder","humiSteam Basic 5 kg/h, 230V 1~, todo/nada o proporcional, cilindro no practicable"]
[null,"UE005YDC01","humiSteam Basic 5 kg/h, 230V 1~, ON/OFF or proportional, cleanable cylinder","humiSteam Basic 5 kg/h, 230V 1~, ON/OFF o proporzionale, cilindro apribile","humiSteam Basic 5 kg/h, 230V 1~, ON/OFF or proportional, cleanable cylinder","humiSteam Basic 5 kg/h, 230V 1~, ON/OFF ou proportionnel, cylindre ouvrant","humiSteam Basic 5 kg/h, 230V 1~, EIN/AUS-Betrieb oder proportional Regelung, Reinigungsfähig-Dampfzylinder","humiSteam Basic 5 kg/h, 230V 1~, todo/nada o proporcional, cilindro practicable"]
[null,"UE005YK001","humiSteam Basic 5 kg/h, 230V 3~, ON/OFF or proportional, disposable cylinder","humiSteam Basic 5 kg/h, 230V 3~,  ON/OFF o proporzionale, cilindro non apribile","humiSteam Basic 5 kg/h, 230V 3~, ON/OFF or proportional, disposable cylinder","humiSteam Basic 5 kg/h, 230V 3~, ON/OFF ou proportionnel, cylindre non ouvrant","humiSteam Basic 5 kg/h, 230V 3~, EIN/AUS-Betrieb oder proportional Regelung, Einweg-Dampfzylinder","humiSteam Basic 5 kg/h, 230V 3~,  todo/nada o proporcional, cilindro no practicable"]
[null,"UE005YKC01","humiSteam Basic 5 kg/h, 230V 3~, ON/OFF or proportional, cleanable cylinder","humiSteam Basic 5 kg/h, 230V 3~,  ON/OFF o proporzionale, cilindro apribile","humiSteam Basic 5 kg/h, 230V 3~, ON/OFF or proportional, cleanable cylinder","humiSteam Basic 5 kg/h, 230V 3~, ON/OFF ou proportionnel, cylindre ouvrant","humiSteam Basic 5 kg/h, 230V 3~, EIN/AUS-Betrieb oder proportional Regelung, Reinigungsfähig-Dampfzylinder","humiSteam Basic 5 kg/h, 230V 3~,  todo/nada o proporcional, cilindro practicable"]
[null,"UE005YL001","humiSteam Basic 5 kg/h, 400V 3~, ON/OFF or proportional, disposable cylinder","humiSteam Basic 5 kg/h, 400V 3~,  ON/OFF o proporzionale, cilindro non apribile","humiSteam Basic 5 kg/h, 400V 3~, ON/OFF or proportional, disposable cylinder","humiSteam Basic 5 kg/h, 400V 3~, ON/OFF ou proportionnel, cylindre non ouvrant","humiSteam Basic 5 kg/h, 400V 3~, EIN/AUS-Betrieb oder proportional Regelung, Einweg-Dampfzylinder","humiSteam Basic 5 kg/h, 400V 3~,  todo/nada o proporcional, cilindro no practicable"]
[null,"UE005YLC01","humiSteam Basic 5 kg/h, 400V 3~, ON/OFF or proportional, cleanable cylinder","humiSteam Basic 5 kg/h, 400V 3~,  ON/OFF o proporzionale, cilindro apribile","humiSteam Basic 5 kg/h, 400V 3~, ON/OFF or proportional, cleanable cylinder","humiSteam Basic 5 kg/h, 400V 3~, ON/OFF ou proportionnel, cylindre ouvrant","humiSteam Basic 5 kg/h, 400V 3~, EIN/AUS-Betrieb oder proportional Regelung, Reinigungsfähig-Dampfzylinder","humiSteam Basic 5 kg/h, 400V 3~,  todo/nada o proporcional, cilindro practicable"]
[null,"UE005YM001","humiSteam Basic 5 kg/h, 460V 3~, ON/OFF or proportional, disposable cylinder","humiSteam Basic 5 kg/h, 460V 3~,  ON/OFF o proporzionale, cilindro non apribile","humiSteam Basic 5 kg/h, 460V 3~, ON/OFF or proportional, disposable cylinder","humiSteam Basic 5 kg/h, 460V 3~, ON/OFF ou proportionnel, cylindre non ouvrant","humiSteam Basic 5 kg/h, 460V 3~, EIN/AUS-Betrieb oder proportional Regelung, Einweg-Dampfzylinder","humiSteam Basic 5 kg/h, 460V 3~,  todo/nada o proporcional, cilindro no practicable"]
[null,"UE005YMC01","humiSteam Basic 5 kg/h, 460V 3~, ON/OFF or proportional, cleanable cylinder","humiSteam Basic 5 kg/h, 460V 3~,  ON/OFF o proporzionale, cilindro apribile","humiSteam Basic 5 kg/h, 460V 3~, ON/OFF or proportional, cleanable cylinder","humiSteam Basic 5 kg/h, 460V 3~, ON/OFF ou proportionnel, cylindre ouvrant","humiSteam Basic 5 kg/h, 460V 3~, EIN/AUS-Betrieb oder proportional Regelung, Reinigungsfähig-Dampfzylinder","humiSteam Basic 5 kg/h, 460V 3~,  todo/nada o proporcional, cilindro practicable"]
[null,"UE005YN001","humiSteam Basic 5 kg/h, 575V 3~, ON/OFF or proportional, disposable cylinder","humiSteam Basic 5 kg/h, 575V 3~,  ON/OFF o proporzionale, cilindro non apribile","humiSteam Basic 5 kg/h, 575V 3~, ON/OFF or proportional, disposable cylinder","humiSteam Basic 5 kg/h, 575V 3~, ON/OFF ou proportionnel, cylindre non ouvrant","humiSteam Basic 5 kg/h, 575V 3~, EIN/AUS-Betrieb oder proportional Regelung, Einweg-Dampfzylinder","humiSteam Basic 5 kg/h, 575V 3~,  todo/nada o proporcional, cilindro no practicable"]
[null,"UE005YNC01","humiSteam Basic 5 kg/h, 575V 3~, ON/OFF or proportional, cleanable cylinder","humiSteam Basic 5 kg/h, 575V 3~,  ON/OFF o proporzionale, cilindro apribile","humiSteam Basic 5 kg/h, 575V 3~, ON/OFF or proportional, cleanable cylinder","humiSteam Basic 5 kg/h, 575V 3~, ON/OFF ou proportionnel, cylindre ouvrant","humiSteam Basic 5 kg/h, 575V 3~, EIN/AUS-Betrieb oder proportional Regelung, Reinigungsfähig-Dampfzylinder","humiSteam Basic 5 kg/h, 575V 3~,  todo/nada o proporcional, cilindro practicable"]
[null,"UE005YU001","humiSteam Basic 5 kg/h, 208V 1~, ON/OFF or proportional, disposable cylinder","humiSteam Basic 5 kg/h, 208V 1~, ON/OFF o proporzionale, cilindro non apribile","humiSteam Basic 5 kg/h, 208V 1~, ON/OFF or proportional, disposable cylinder","humiSteam Basic 5 kg/h, 208V 1~, ON/OFF ou proportionnel, cylindre non ouvrant","humiSteam Basic 5 kg/h, 208V 1~, EIN/AUS-Betrieb oder proportional Regelung, Einweg-Dampfzylinder","humiSteam Basic 5 kg/h, 208V 1~, todo/nada o proporcional, cilindro no practicable"]
[null,"UE005YUC01","humiSteam Basic 5 kg/h, 208V 1~, ON/OFF or proportional, cleanable cylinder","humiSteam Basic 5 kg/h, 208V 1~, ON/OFF o proporzionale, cilindro apribile","humiSteam Basic 5 kg/h, 208V 1~, ON/OFF or proportional, cleanable cylinder","humiSteam Basic 5 kg/h, 208V 1~, ON/OFF ou proportionnel, cylindre ouvrant","humiSteam Basic 5 kg/h, 208V 1~, EIN/AUS-Betrieb oder proportional Regelung, Reinigungsfähig-Dampfzylinder","humiSteam Basic 5 kg/h, 208V 1~, todo/nada o proporcional, cilindro practicable"]
[null,"UE005YW001","humiSteam Basic 5 kg/h, 208V 3~, ON/OFF or proportional, disposable cylinder","humiSteam Basic 5 kg/h, 208V 3~,  ON/OFF o proporzionale, cilindro non apribile","humiSteam Basic 5 kg/h, 208V 3~, ON/OFF or proportional, disposable cylinder","humiSteam Basic 5 kg/h, 208V 3~, ON/OFF ou proportionnel, cylindre non ouvrant","humiSteam Basic 5 kg/h, 208V 3~, EIN/AUS-Betrieb oder proportional Regelung, Einweg-Dampfzylinder","humiSteam Basic 5 kg/h, 208V 3~,  todo/nada o proporcional, cilindro no practicable"]
[null,"UE005YWC01","humiSteam Basic 5 kg/h, 208V 3~, ON/OFF or proportional, cleanable cylinder","humiSteam Basic 5 kg/h, 208V 3~,  ON/OFF o proporzionale, cilindro apribile","humiSteam Basic 5 kg/h, 208V 3~, ON/OFF or proportional, cleanable cylinder","humiSteam Basic 5 kg/h, 208V 3~, ON/OFF ou proportionnel, cylindre ouvrant","humiSteam Basic 5 kg/h, 208V 3~, EIN/AUS-Betrieb oder proportional Regelung, Reinigungsfähig-Dampfzylinder","humiSteam Basic 5 kg/h, 208V 3~,  todo/nada o proporcional, cilindro practicable"]
[null,"UE008YK001","humiSteam Basic 8 kg/h, 230V 3~, ON/OFF or proportional, disposable cylinder","humiSteam Basic 8 kg/h, 230V 3~,  ON/OFF o proporzionale, cilindro non apribile","humiSteam Basic 8 kg/h, 230V 3~, ON/OFF or proportional, disposable cylinder","humiSteam Basic 8 kg/h, 230V 3~, ON/OFF ou proportionnel, cylindre non ouvrant","humiSteam Basic 8 kg/h, 230V 3~, EIN/AUS-Betrieb oder proportional Regelung, Einweg-Dampfzylinder","humiSteam Basic 8 kg/h, 230V 3~,  todo/nada o proporcional, cilindro no practicable"]
[null,"UE008YKC01","humiSteam Basic 8 kg/h, 230V 3~, ON/OFF or proportional, cleanable cylinder","humiSteam Basic 8 kg/h, 230V 3~,  ON/OFF o proporzionale, cilindro apribile","humiSteam Basic 8 kg/h, 230V 3~, ON/OFF or proportional, cleanable cylinder","humiSteam Basic 8 kg/h, 230V 3~, ON/OFF ou proportionnel, cylindre ouvrant","humiSteam Basic 8 kg/h, 230V 3~, EIN/AUS-Betrieb oder proportional Regelung, Reinigungsfähig-Dampfzylinder","humiSteam Basic 8 kg/h, 230V 3~,  todo/nada o proporcional, cilindro practicable"]
[null,"UE008YL001","humiSteam Basic 8 kg/h, 400V 3~, ON/OFF or proportional, disposable cylinder","humiSteam Basic 8 kg/h, 400V 3~,  ON/OFF o proporzionale, cilindro non apribile","humiSteam Basic 8 kg/h, 400V 3~, ON/OFF or proportional, disposable cylinder","humiSteam Basic 8 kg/h, 400V 3~, ON/OFF ou proportionnel, cylindre non ouvrant","humiSteam Basic 8 kg/h, 400V 3~, EIN/AUS-Betrieb oder proportional Regelung, Einweg-Dampfzylinder","humiSteam Basic 8 kg/h, 400V 3~,  todo/nada o proporcional, cilindro no practicable"]
[null,"UE008YLC01","humiSteam Basic 8 kg/h, 400V 3~, ON/OFF or proportional, cleanable cylinder","humiSteam Basic 8 kg/h, 400V 3~,  ON/OFF o proporzionale, cilindro apribile","humiSteam Basic 8 kg/h, 400V 3~, ON/OFF or proportional, cleanable cylinder","humiSteam Basic 8 kg/h, 400V 3~, ON/OFF ou proportionnel, cylindre ouvrant","humiSteam Basic 8 kg/h, 400V 3~, EIN/AUS-Betrieb oder proportional Regelung, Reinigungsfähig-Dampfzylinder","humiSteam Basic 8 kg/h, 400V 3~,  todo/nada o proporcional, cilindro practicable"]
[null,"UE008YM001","humiSteam Basic 8 kg/h, 460V 3~, ON/OFF or proportional, disposable cylinder","humiSteam Basic 8 kg/h, 460V 3~,  ON/OFF o proporzionale, cilindro non apribile","humiSteam Basic 8 kg/h, 460V 3~, ON/OFF or proportional, disposable cylinder","humiSteam Basic 8 kg/h, 460V 3~, ON/OFF ou proportionnel, cylindre non ouvrant","humiSteam Basic 8 kg/h, 460V 3~, EIN/AUS-Betrieb oder proportional Regelung, Einweg-Dampfzylinder","humiSteam Basic 8 kg/h, 460V 3~,  todo/nada o proporcional, cilindro no practicable"]
[null,"UE008YMC01","humiSteam Basic 8 kg/h, 460V 3~, ON/OFF or proportional, cleanable cylinder","humiSteam Basic 8 kg/h, 460V 3~,  ON/OFF o proporzionale, cilindro apribile","humiSteam Basic 8 kg/h, 460V 3~, ON/OFF or proportional, cleanable cylinder","humiSteam Basic 8 kg/h, 460V 3~, ON/OFF ou proportionnel, cylindre ouvrant","humiSteam Basic 8 kg/h, 460V 3~, EIN/AUS-Betrieb oder proportional Regelung, Reinigungsfähig-Dampfzylinder","humiSteam Basic 8 kg/h, 460V 3~,  todo/nada o proporcional, cilindro practicable"]
[null,"UE008YN001","humiSteam Basic 8 kg/h, 575V 3~, ON/OFF or proportional, disposable cylinder","humiSteam Basic 8 kg/h, 575V 3~,  ON/OFF o proporzionale, cilindro non apribile","humiSteam Basic 8 kg/h, 575V 3~, ON/OFF or proportional, disposable cylinder","humiSteam Basic 8 kg/h, 575V 3~, ON/OFF ou proportionnel, cylindre non ouvrant","humiSteam Basic 8 kg/h, 575V 3~, EIN/AUS-Betrieb oder proportional Regelung, Einweg-Dampfzylinder","humiSteam Basic 8 kg/h, 575V 3~,  todo/nada o proporcional, cilindro no practicable"]
[null,"UE008YNC01","humiSteam Basic 8 kg/h, 575V 3~, ON/OFF or proportional, cleanable cylinder","humiSteam Basic 8 kg/h, 575V 3~,  ON/OFF o proporzionale, cilindro apribile","humiSteam Basic 8 kg/h, 575V 3~, ON/OFF or proportional, cleanable cylinder","humiSteam Basic 8 kg/h, 575V 3~, ON/OFF ou proportionnel, cylindre ouvrant","humiSteam Basic 8 kg/h, 575V 3~, EIN/AUS-Betrieb oder proportional Regelung, Reinigungsfähig-Dampfzylinder","humiSteam Basic 8 kg/h, 575V 3~,  todo/nada o proporcional, cilindro practicable"]
[null,"UE008YW001","humiSteam Basic 8 kg/h, 208V 3~, ON/OFF or proportional, disposable cylinder","humiSteam Basic 8 kg/h, 208V 3~,  ON/OFF o proporzionale, cilindro non apribile","humiSteam Basic 8 kg/h, 208V 3~, ON/OFF or proportional, disposable cylinder","humiSteam Basic 8 kg/h, 208V 3~, ON/OFF ou proportionnel, cylindre non ouvrant","humiSteam Basic 8 kg/h, 208V 3~, EIN/AUS-Betrieb oder proportional Regelung, Einweg-Dampfzylinder","humiSteam Basic 8 kg/h, 208V 3~,  todo/nada o proporcional, cilindro no practicable"]
[null,"UE008YWC01","humiSteam Basic 8 kg/h, 208V 3~, ON/OFF or proportional, cleanable cylinder","humiSteam Basic 8 kg/h, 208V 3~,  ON/OFF o proporzionale, cilindro apribile","humiSteam Basic 8 kg/h, 208V 3~, ON/OFF or proportional, cleanable cylinder","humiSteam Basic 8 kg/h, 208V 3~, ON/OFF ou proportionnel, cylindre ouvrant","humiSteam Basic 8 kg/h, 208V 3~, EIN/AUS-Betrieb oder proportional Regelung, Reinigungsfähig-Dampfzylinder","humiSteam Basic 8 kg/h, 208V 3~,  todo/nada o proporcional, cilindro practicable"]
[null,"UE009YD001","humiSteam Basic 9 kg/h, 230V 1~, ON/OFF or proportional, disposable cylinder","humiSteam Basic 9 kg/h, 230V 1~, ON/OFF o proporzionale, cilindro non apribile","humiSteam Basic 9 kg/h, 230V 1~, ON/OFF or proportional, disposable cylinder","humiSteam Basic 9 kg/h, 230V 1~, ON/OFF ou proportionnel, cylindre non ouvrant","humiSteam Basic 9 kg/h, 230V 1~, EIN/AUS-Betrieb oder proportional Regelung, Einweg-Dampfzylinder","humiSteam Basic 9 kg/h, 230V 1~, todo/nada o proporcional, cilindro no practicable"]
[null,"UE009YDC01","humiSteam Basic 9 kg/h, 230V 1~, ON/OFF or proportional, cleanable cylinder","humiSteam Basic 9 kg/h, 230V 1~, ON/OFF o proporzionale, cilindro apribile","humiSteam Basic 9 kg/h, 230V 1~, ON/OFF or proportional, cleanable cylinder","humiSteam Basic 9 kg/h, 230V 1~, ON/OFF ou proportionnel, cylindre ouvrant","humiSteam Basic 9 kg/h, 230V 1~, EIN/AUS-Betrieb oder proportional Regelung, Reinigungsfähig-Dampfzylinder","humiSteam Basic 9 kg/h, 230V 1~, todo/nada o proporcional, cilindro practicable"]
[null,"UE009YU001","humiSteam Basic 9 kg/h, 208V 1~, ON/OFF or proportional, disposable cylinder","humiSteam Basic 9 kg/h, 208V 1~, ON/OFF o proporzionale, cilindro non apribile","humiSteam Basic 9 kg/h, 208V 1~, ON/OFF or proportional, disposable cylinder","humiSteam Basic 9 kg/h, 208V 1~, ON/OFF ou proportionnel, cylindre non ouvrant","humiSteam Basic 9 kg/h, 208V 1~, EIN/AUS-Betrieb oder proportional Regelung, Einweg-Dampfzylinder","humiSteam Basic 9 kg/h, 208V 1~, todo/nada o proporcional, cilindro no practicable"]
[null,"UE009YUC01","humiSteam Basic 9 kg/h, 208V 1~, ON/OFF or proportional, cleanable cylinder","humiSteam Basic 9 kg/h, 208V 1~, ON/OFF o proporzionale, cilindro apribile","humiSteam Basic 9 kg/h, 208V 1~, ON/OFF or proportional, cleanable cylinder","humiSteam Basic 9 kg/h, 208V 1~, ON/OFF ou proportionnel, cylindre ouvrant","humiSteam Basic 9 kg/h, 208V 1~, EIN/AUS-Betrieb oder proportional Regelung, Reinigungsfähig-Dampfzylinder","humiSteam Basic 9 kg/h, 208V 1~, todo/nada o proporcional, cilindro practicable"]
[null,"UE010YK001","humiSteam Basic 10 kg/h, 230V 3~, ON/OFF or proportional, disposable cylinder","humiSteam Basic 10 kg/h, 230V 3~,  ON/OFF o proporzionale, cilindro non apribile","humiSteam Basic 10 kg/h, 230V 3~, ON/OFF or proportional, disposable cylinder","humiSteam Basic 10 kg/h, 230V 3~, ON/OFF ou proportionnel, cylindre non ouvrant","humiSteam Basic 10 kg/h, 230V 3~, EIN/AUS-Betrieb oder proportional Regelung, Einweg-Dampfzylinder","humiSteam Basic 10 kg/h, 230V 3~,  todo/nada o proporcional, cilindro no practicable"]
[null,"UE010YKC01","humiSteam Basic 10 kg/h, 230V 3~, ON/OFF or proportional, cleanable cylinder","humiSteam Basic 10 kg/h, 230V 3~,  ON/OFF o proporzionale, cilindro apribile","humiSteam Basic 10 kg/h, 230V 3~, ON/OFF or proportional, cleanable cylinder","humiSteam Basic 10 kg/h, 230V 3~, ON/OFF ou proportionnel, cylindre ouvrant","humiSteam Basic 10 kg/h, 230V 3~, EIN/AUS-Betrieb oder proportional Regelung, Reinigungsfähig-Dampfzylinder","humiSteam Basic 10 kg/h, 230V 3~,  todo/nada o proporcional, cilindro practicable"]
[null,"UE010YL001","humiSteam Basic 10 kg/h, 400V 3~, ON/OFF or proportional, disposable cylinder","humiSteam Basic 10 kg/h, 400V 3~,  ON/OFF o proporzionale, cilindro non apribile","humiSteam Basic 10 kg/h, 400V 3~, ON/OFF or proportional, disposable cylinder","humiSteam Basic 10 kg/h, 400V 3~, ON/OFF ou proportionnel, cylindre non ouvrant","humiSteam Basic 10 kg/h, 400V 3~, EIN/AUS-Betrieb oder proportional Regelung, Einweg-Dampfzylinder","humiSteam Basic 10 kg/h, 400V 3~,  todo/nada o proporcional, cilindro no practicable"]
[null,"UE010YLC01","humiSteam Basic 10 kg/h, 400V 3~, ON/OFF or proportional, cleanable cylinder","humiSteam Basic 10 kg/h, 400V 3~,  ON/OFF o proporzionale, cilindro apribile","humiSteam Basic 10 kg/h, 400V 3~, ON/OFF or proportional, cleanable cylinder","humiSteam Basic 10 kg/h, 400V 3~, ON/OFF ou proportionnel, cylindre ouvrant","humiSteam Basic 10 kg/h, 400V 3~, EIN/AUS-Betrieb oder proportional Regelung, Reinigungsfähig-Dampfzylinder","humiSteam Basic 10 kg/h, 400V 3~,  todo/nada o proporcional, cilindro practicable"]
[null,"UE010YM001","humiSteam Basic 10 kg/h, 460V 3~, ON/OFF or proportional, disposable cylinder","humiSteam Basic 10 kg/h, 460V 3~,  ON/OFF o proporzionale, cilindro non apribile","humiSteam Basic 10 kg/h, 460V 3~, ON/OFF or proportional, disposable cylinder","humiSteam Basic 10 kg/h, 460V 3~, ON/OFF ou proportionnel, cylindre non ouvrant","humiSteam Basic 10 kg/h, 460V 3~, EIN/AUS-Betrieb oder proportional Regelung, Einweg-Dampfzylinder","humiSteam Basic 10 kg/h, 460V 3~,  todo/nada o proporcional, cilindro no practicable"]
[null,"UE010YMC01","humiSteam Basic 10 kg/h, 460V 3~, ON/OFF or proportional, cleanable cylinder","humiSteam Basic 10 kg/h, 460V 3~,  ON/OFF o proporzionale, cilindro apribile","humiSteam Basic 10 kg/h, 460V 3~, ON/OFF or proportional, cleanable cylinder","humiSteam Basic 10 kg/h, 460V 3~, ON/OFF ou proportionnel, cylindre ouvrant","humiSteam Basic 10 kg/h, 460V 3~, EIN/AUS-Betrieb oder proportional Regelung, Reinigungsfähig-Dampfzylinder","humiSteam Basic 10 kg/h, 460V 3~,  todo/nada o proporcional, cilindro practicable"]
[null,"UE010YN001","humiSteam Basic 10 kg/h, 575V 3~, ON/OFF or proportional, disposable cylinder","humiSteam Basic 10 kg/h, 575V 3~,  ON/OFF o proporzionale, cilindro non apribile","humiSteam Basic 10 kg/h, 575V 3~, ON/OFF or proportional, disposable cylinder","humiSteam Basic 10 kg/h, 575V 3~, ON/OFF ou proportionnel, cylindre non ouvrant","humiSteam Basic 10 kg/h, 575V 3~, EIN/AUS-Betrieb oder proportional Regelung, Einweg-Dampfzylinder","humiSteam Basic 10 kg/h, 575V 3~,  todo/nada o proporcional, cilindro no practicable"]
[null,"UE010YNC01","humiSteam Basic 10 kg/h, 575V 3~, ON/OFF or proportional, cleanable cylinder","humiSteam Basic 10 kg/h, 575V 3~,  ON/OFF o proporzionale, cilindro apribile","humiSteam Basic 10 kg/h, 575V 3~, ON/OFF or proportional, cleanable cylinder","humiSteam Basic 10 kg/h, 575V 3~, ON/OFF ou proportionnel, cylindre ouvrant","humiSteam Basic 10 kg/h, 575V 3~, EIN/AUS-Betrieb oder proportional Regelung, Reinigungsfähig-Dampfzylinder","humiSteam Basic 10 kg/h, 575V 3~,  todo/nada o proporcional, cilindro practicable"]
[null,"UE010YW001","humiSteam Basic 10 kg/h, 208V 3~, ON/OFF or proportional, disposable cylinder","humiSteam Basic 10 kg/h, 208V 3~,  ON/OFF o proporzionale, cilindro non apribile","humiSteam Basic 10 kg/h, 208V 3~, ON/OFF or proportional, disposable cylinder","humiSteam Basic 10 kg/h, 208V 3~, ON/OFF ou proportionnel, cylindre non ouvrant","humiSteam Basic 10 kg/h, 208V 3~, EIN/AUS-Betrieb oder proportional Regelung, Einweg-Dampfzylinder","humiSteam Basic 10 kg/h, 208V 3~,  todo/nada o proporcional, cilindro no practicable"]
[null,"UE010YWC01","humiSteam Basic 10 kg/h, 208V 3~, ON/OFF or proportional, cleanable cylinder","humiSteam Basic 10 kg/h, 208V 3~,  ON/OFF o proporzionale, cilindro apribile","humiSteam Basic 10 kg/h, 208V 3~, ON/OFF or proportional, cleanable cylinder","humiSteam Basic 10 kg/h, 208V 3~, ON/OFF ou proportionnel, cylindre ouvrant","humiSteam Basic 10 kg/h, 208V 3~, EIN/AUS-Betrieb oder proportional Regelung, Reinigungsfähig-Dampfzylinder","humiSteam Basic 10 kg/h, 208V 3~,  todo/nada o proporcional, cilindro practicable"]
[null,"UE015YK001","humiSteam Basic 15 kg/h, 230V 3~, ON/OFF or proportional, disposable cylinder","humiSteam Basic 15 kg/h, 230V 3~,  ON/OFF o proporzionale, cilindro non apribile","humiSteam Basic 15 kg/h, 230V 3~, ON/OFF or proportional, disposable cylinder","humiSteam Basic 15 kg/h, 230V 3~, ON/OFF ou proportionnel, cylindre non ouvrant","humiSteam Basic 15 kg/h, 230V 3~, EIN/AUS-Betrieb oder proportional Regelung, Einweg-Dampfzylinder","humiSteam Basic 15 kg/h, 230V 3~,  todo/nada o proporcional, cilindro no practicable"]
[null,"UE015YKC01","humiSteam Basic 15 kg/h, 230V 3~, ON/OFF or proportional, cleanable cylinder","humiSteam Basic 15 kg/h, 230V 3~,  ON/OFF o proporzionale, cilindro apribile","humiSteam Basic 15 kg/h, 230V 3~, ON/OFF or proportional, cleanable cylinder","humiSteam Basic 15 kg/h, 230V 3~, ON/OFF ou proportionnel, cylindre ouvrant","humiSteam Basic 15 kg/h, 230V 3~, EIN/AUS-Betrieb oder proportional Regelung, Reinigungsfähig-Dampfzylinder","humiSteam Basic 15 kg/h, 230V 3~,  todo/nada o proporcional, cilindro practicable"]
[null,"UE015YL001","humiSteam Basic 15 kg/h, 400V 3~, ON/OFF or proportional, disposable cylinder","humiSteam Basic 15 kg/h, 400V 3~,  ON/OFF o proporzionale, cilindro non apribile","humiSteam Basic 15 kg/h, 400V 3~, ON/OFF or proportional, disposable cylinder","humiSteam Basic 15 kg/h, 400V 3~, ON/OFF ou proportionnel, cylindre non ouvrant","humiSteam Basic 15 kg/h, 400V 3~, EIN/AUS-Betrieb oder proportional Regelung, Einweg-Dampfzylinder","humiSteam Basic 15 kg/h, 400V 3~,  todo/nada o proporcional, cilindro no practicable"]
[null,"UE015YLC01","humiSteam Basic 15 kg/h, 400V 3~, ON/OFF or proportional, cleanable cylinder","humiSteam Basic 15 kg/h, 400V 3~,  ON/OFF o proporzionale, cilindro apribile","humiSteam Basic 15 kg/h, 400V 3~, ON/OFF or proportional, cleanable cylinder","humiSteam Basic 15 kg/h, 400V 3~, ON/OFF ou proportionnel, cylindre ouvrant","humiSteam Basic 15 kg/h, 400V 3~, EIN/AUS-Betrieb oder proportional Regelung, Reinigungsfähig-Dampfzylinder","humiSteam Basic 15 kg/h, 400V 3~,  todo/nada o proporcional, cilindro practicable"]
[null,"UE015YM001","humiSteam Basic 15 kg/h, 460V 3~, ON/OFF or proportional, disposable cylinder","humiSteam Basic 15 kg/h, 460V 3~,  ON/OFF o proporzionale, cilindro non apribile","humiSteam Basic 15 kg/h, 460V 3~, ON/OFF or proportional, disposable cylinder","humiSteam Basic 15 kg/h, 460V 3~, ON/OFF ou proportionnel, cylindre non ouvrant","humiSteam Basic 15 kg/h, 460V 3~, EIN/AUS-Betrieb oder proportional Regelung, Einweg-Dampfzylinder","humiSteam Basic 15 kg/h, 460V 3~,  todo/nada o proporcional, cilindro no practicable"]
[null,"UE015YMC01","humiSteam Basic 15 kg/h, 460V 3~, ON/OFF or proportional, cleanable cylinder","humiSteam Basic 15 kg/h, 460V 3~,  ON/OFF o proporzionale, cilindro apribile","humiSteam Basic 15 kg/h, 460V 3~, ON/OFF or proportional, cleanable cylinder","humiSteam Basic 15 kg/h, 460V 3~, ON/OFF ou proportionnel, cylindre ouvrant","humiSteam Basic 15 kg/h, 460V 3~, EIN/AUS-Betrieb oder proportional Regelung, Reinigungsfähig-Dampfzylinder","humiSteam Basic 15 kg/h, 460V 3~,  todo/nada o proporcional, cilindro practicable"]
[null,"UE015YN001","humiSteam Basic 15 kg/h, 575V 3~, ON/OFF or proportional, disposable cylinder","humiSteam Basic 15 kg/h, 575V 3~,  ON/OFF o proporzionale, cilindro non apribile","humiSteam Basic 15 kg/h, 575V 3~, ON/OFF or proportional, disposable cylinder","humiSteam Basic 15 kg/h, 575V 3~, ON/OFF ou proportionnel, cylindre non ouvrant","humiSteam Basic 15 kg/h, 575V 3~, EIN/AUS-Betrieb oder proportional Regelung, Einweg-Dampfzylinder","humiSteam Basic 15 kg/h, 575V 3~,  todo/nada o proporcional, cilindro no practicable"]
[null,"UE015YNC01","humiSteam Basic 15 kg/h, 575V 3~, ON/OFF or proportional, cleanable cylinder","humiSteam Basic 15 kg/h, 575V 3~,  ON/OFF o proporzionale, cilindro apribile","humiSteam Basic 15 kg/h, 575V 3~, ON/OFF or proportional, cleanable cylinder","humiSteam Basic 15 kg/h, 575V 3~, ON/OFF ou proportionnel, cylindre ouvrant","humiSteam Basic 15 kg/h, 575V 3~, EIN/AUS-Betrieb oder proportional Regelung, Reinigungsfähig-Dampfzylinder","humiSteam Basic 15 kg/h, 575V 3~,  todo/nada o proporcional, cilindro practicable"]
[null,"UE015YW001","humiSteam Basic 15 kg/h, 208V 3~, ON/OFF or proportional, disposable cylinder","humiSteam Basic 15 kg/h, 208V 3~,  ON/OFF o proporzionale, cilindro non apribile","humiSteam Basic 15 kg/h, 208V 3~, ON/OFF or proportional, disposable cylinder","humiSteam Basic 15 kg/h, 208V 3~, ON/OFF ou proportionnel, cylindre non ouvrant","humiSteam Basic 15 kg/h, 208V 3~, EIN/AUS-Betrieb oder proportional Regelung, Einweg-Dampfzylinder","humiSteam Basic 15 kg/h, 208V 3~,  todo/nada o proporcional, cilindro no practicable"]
[null,"UE015YWC01","humiSteam Basic 15 kg/h, 208V 3~, ON/OFF or proportional, cleanable cylinder","humiSteam Basic 15 kg/h, 208V 3~,  ON/OFF o proporzionale, cilindro apribile","humiSteam Basic 15 kg/h, 208V 3~, ON/OFF or proportional, cleanable cylinder","humiSteam Basic 15 kg/h, 208V 3~, ON/OFF ou proportionnel, cylindre ouvrant","humiSteam Basic 15 kg/h, 208V 3~, EIN/AUS-Betrieb oder proportional Regelung, Reinigungsfähig-Dampfzylinder","humiSteam Basic 15 kg/h, 208V 3~,  todo/nada o proporcional, cilindro practicable"]
[null,"UE018YL001","humiSteam Basic 18 kg/h, 400V 3~, ON/OFF or proportional, disposable cylinder","humiSteam Basic 18 kg/h, 400V 3~,  ON/OFF o proporzionale, cilindro non apribile","humiSteam Basic 18 kg/h, 400V 3~, ON/OFF or proportional, disposable cylinder","humiSteam Basic 18 kg/h, 400V 3~, ON/OFF ou proportionnel, cylindre non ouvrant","humiSteam Basic 18 kg/h, 400V 3~, EIN/AUS-Betrieb oder proportional Regelung, Einweg-Dampfzylinder","humiSteam Basic 18 kg/h, 400V 3~,  todo/nada o proporcional, cilindro no practicable"]
[null,"UE018YLC01","humiSteam Basic 18 kg/h, 400V 3~, ON/OFF or proportional, cleanable cylinder","humiSteam Basic 18 kg/h, 400V 3~,  ON/OFF o proporzionale, cilindro apribile","humiSteam Basic 18 kg/h, 400V 3~, ON/OFF or proportional, cleanable cylinder","humiSteam Basic 18 kg/h, 400V 3~, ON/OFF ou proportionnel, cylindre ouvrant","humiSteam Basic 18 kg/h, 400V 3~, EIN/AUS-Betrieb oder proportional Regelung, Reinigungsfähig-Dampfzylinder","humiSteam Basic 18 kg/h, 400V 3~,  todo/nada o proporcional, cilindro practicable"]
[null,"UE018YM001","humiSteam Basic 18 kg/h, 460V 3~, ON/OFF or proportional, disposable cylinder","humiSteam Basic 18 kg/h, 460V 3~,  ON/OFF o proporzionale, cilindro non apribile","humiSteam Basic 18 kg/h, 460V 3~, ON/OFF or proportional, disposable cylinder","humiSteam Basic 18 kg/h, 460V 3~, ON/OFF ou proportionnel, cylindre non ouvrant","humiSteam Basic 18 kg/h, 460V 3~, EIN/AUS-Betrieb oder proportional Regelung, Einweg-Dampfzylinder","humiSteam Basic 18 kg/h, 460V 3~,  todo/nada o proporcional, cilindro no practicable"]
[null,"UE018YMC01","humiSteam Basic 18 kg/h, 460V 3~, ON/OFF or proportional, cleanable cylinder","humiSteam Basic 18 kg/h, 460V 3~,  ON/OFF o proporzionale, cilindro apribile","humiSteam Basic 18 kg/h, 460V 3~, ON/OFF or proportional, cleanable cylinder","humiSteam Basic 18 kg/h, 460V 3~, ON/OFF ou proportionnel, cylindre ouvrant","humiSteam Basic 18 kg/h, 460V 3~, EIN/AUS-Betrieb oder proportional Regelung, Reinigungsfähig-Dampfzylinder","humiSteam Basic 18 kg/h, 460V 3~,  todo/nada o proporcional, cilindro practicable"]
[null,"UE018YN001","humiSteam Basic 18 kg/h, 575V 3~, ON/OFF or proportional, disposable cylinder","humiSteam Basic 18 kg/h, 575V 3~,  ON/OFF o proporzionale, cilindro non apribile","humiSteam Basic 18 kg/h, 575V 3~, ON/OFF or proportional, disposable cylinder","humiSteam Basic 18 kg/h, 575V 3~, ON/OFF ou proportionnel, cylindre non ouvrant","humiSteam Basic 18 kg/h, 575V 3~, EIN/AUS-Betrieb oder proportional Regelung, Einweg-Dampfzylinder","humiSteam Basic 18 kg/h, 575V 3~,  todo/nada o proporcional, cilindro no practicable"]
[null,"UE018YNC01","humiSteam Basic 18 kg/h, 575V 3~, ON/OFF or proportional, cleanable cylinder","humiSteam Basic 18 kg/h, 575V 3~,  ON/OFF o proporzionale, cilindro apribile","humiSteam Basic 18 kg/h, 575V 3~, ON/OFF or proportional, cleanable cylinder","humiSteam Basic 18 kg/h, 575V 3~, ON/OFF ou proportionnel, cylindre ouvrant","humiSteam Basic 18 kg/h, 575V 3~, EIN/AUS-Betrieb oder proportional Regelung, Reinigungsfähig-Dampfzylinder","humiSteam Basic 18 kg/h, 575V 3~,  todo/nada o proporcional, cilindro practicable"]
[null,"UE025YK001","humiSteam Basic 25 kg/h, 230V 3~, ON/OFF or proportional, disposable cylinder","humiSteam Basic 25 kg/h, 230V 3~,  ON/OFF o proporzionale, cilindro non apribile","humiSteam Basic 25 kg/h, 230V 3~, ON/OFF or proportional, disposable cylinder","humiSteam Basic 25 kg/h, 230V 3~, ON/OFF ou proportionnel, cylindre non ouvrant","humiSteam Basic 25 kg/h, 230V 3~, EIN/AUS-Betrieb oder proportional Regelung, Einweg-Dampfzylinder","humiSteam Basic 25 kg/h, 230V 3~,  todo/nada o proporcional, cilindro no practicable"]
[null,"UE025YKC01","humiSteam Basic 25 kg/h, 230V 3~, ON/OFF or proportional, cleanable cylinder","humiSteam Basic 25 kg/h, 230V 3~,  ON/OFF o proporzionale, cilindro apribile","humiSteam Basic 25 kg/h, 230V 3~, ON/OFF or proportional, cleanable cylinder","humiSteam Basic 25 kg/h, 230V 3~, ON/OFF ou proportionnel, cylindre ouvrant","humiSteam Basic 25 kg/h, 230V 3~, EIN/AUS-Betrieb oder proportional Regelung, Reinigungsfähig-Dampfzylinder","humiSteam Basic 25 kg/h, 230V 3~,  todo/nada o proporcional, cilindro practicable"]
[null,"UE025YL001","humiSteam Basic 25 kg/h, 400V 3~, ON/OFF or proportional, disposable cylinder","humiSteam Basic 25 kg/h, 400V 3~,  ON/OFF o proporzionale, cilindro non apribile","humiSteam Basic 25 kg/h, 400V 3~, ON/OFF or proportional, disposable cylinder","humiSteam Basic 25 kg/h, 400V 3~, ON/OFF ou proportionnel, cylindre non ouvrant","humiSteam Basic 25 kg/h, 400V 3~, EIN/AUS-Betrieb oder proportional Regelung, Einweg-Dampfzylinder","humiSteam Basic 25 kg/h, 400V 3~,  todo/nada o proporcional, cilindro no practicable"]
[null,"UE025YLC01","humiSteam Basic 25 kg/h, 400V 3~, ON/OFF or proportional, cleanable cylinder","humiSteam Basic 25 kg/h, 400V 3~,  ON/OFF o proporzionale, cilindro apribile","humiSteam Basic 25 kg/h, 400V 3~, ON/OFF or proportional, cleanable cylinder","humiSteam Basic 25 kg/h, 400V 3~, ON/OFF ou proportionnel, cylindre ouvrant","humiSteam Basic 25 kg/h, 400V 3~, EIN/AUS-Betrieb oder proportional Regelung, Reinigungsfähig-Dampfzylinder","humiSteam Basic 25 kg/h, 400V 3~,  todo/nada o proporcional, cilindro practicable"]
[null,"UE025YM001","humiSteam Basic 25 kg/h, 460V 3~, ON/OFF or proportional, disposable cylinder","humiSteam Basic 25 kg/h, 460V 3~,  ON/OFF o proporzionale, cilindro non apribile","humiSteam Basic 25 kg/h, 460V 3~, ON/OFF or proportional, disposable cylinder","humiSteam Basic 25 kg/h, 460V 3~, ON/OFF ou proportionnel, cylindre non ouvrant","humiSteam Basic 25 kg/h, 460V 3~, EIN/AUS-Betrieb oder proportional Regelung, Einweg-Dampfzylinder","humiSteam Basic 25 kg/h, 460V 3~,  todo/nada o proporcional, cilindro no practicable"]
[null,"UE025YMC01","humiSteam Basic 25 kg/h, 460V 3~, ON/OFF or proportional, cleanable cylinder","humiSteam Basic 25 kg/h, 460V 3~,  ON/OFF o proporzionale, cilindro apribile","humiSteam Basic 25 kg/h, 460V 3~, ON/OFF or proportional, cleanable cylinder","humiSteam Basic 25 kg/h, 460V 3~, ON/OFF ou proportionnel, cylindre ouvrant","humiSteam Basic 25 kg/h, 460V 3~, EIN/AUS-Betrieb oder proportional Regelung, Reinigungsfähig-Dampfzylinder","humiSteam Basic 25 kg/h, 460V 3~,  todo/nada o proporcional, cilindro practicable"]
[null,"UE025YN001","humiSteam Basic 25 kg/h, 575V 3~, ON/OFF or proportional, disposable cylinder","humiSteam Basic 25 kg/h, 575V 3~,  ON/OFF o proporzionale, cilindro non apribile","humiSteam Basic 25 kg/h, 575V 3~, ON/OFF or proportional, disposable cylinder","humiSteam Basic 25 kg/h, 575V 3~, ON/OFF ou proportionnel, cylindre non ouvrant","humiSteam Basic 25 kg/h, 575V 3~, EIN/AUS-Betrieb oder proportional Regelung, Einweg-Dampfzylinder","humiSteam Basic 25 kg/h, 575V 3~,  todo/nada o proporcional, cilindro no practicable"]
[null,"UE025YNC01","humiSteam Basic 25 kg/h, 575V 3~, ON/OFF or proportional, cleanable cylinder","humiSteam Basic 25 kg/h, 575V 3~,  ON/OFF o proporzionale, cilindro apribile","humiSteam Basic 25 kg/h, 575V 3~, ON/OFF or proportional, cleanable cylinder","humiSteam Basic 25 kg/h, 575V 3~, ON/OFF ou proportionnel, cylindre ouvrant","humiSteam Basic 25 kg/h, 575V 3~, EIN/AUS-Betrieb oder proportional Regelung, Reinigungsfähig-Dampfzylinder","humiSteam Basic 25 kg/h, 575V 3~,  todo/nada o proporcional, cilindro practicable"]
[null,"UE025YW001","humiSteam Basic 25 kg/h, 208V 3~, ON/OFF or proportional, disposable cylinder","humiSteam Basic 25 kg/h, 208V 3~,  ON/OFF o proporzionale, cilindro non apribile","humiSteam Basic 25 kg/h, 208V 3~, ON/OFF or proportional, disposable cylinder","humiSteam Basic 25 kg/h, 208V 3~, ON/OFF ou proportionnel, cylindre non ouvrant","humiSteam Basic 25 kg/h, 208V 3~, EIN/AUS-Betrieb oder proportional Regelung, Einweg-Dampfzylinder","humiSteam Basic 25 kg/h, 208V 3~,  todo/nada o proporcional, cilindro no practicable"]
[null,"UE025YWC01","humiSteam Basic 25 kg/h, 208V 3~, ON/OFF or proportional, cleanable cylinder","humiSteam Basic 25 kg/h, 208V 3~,  ON/OFF o proporzionale, cilindro apribile","humiSteam Basic 25 kg/h, 208V 3~, ON/OFF or proportional, cleanable cylinder","humiSteam Basic 25 kg/h, 208V 3~, ON/OFF ou proportionnel, cylindre ouvrant","humiSteam Basic 25 kg/h, 208V 3~, EIN/AUS-Betrieb oder proportional Regelung, Reinigungsfähig-Dampfzylinder","humiSteam Basic 25 kg/h, 208V 3~,  todo/nada o proporcional, cilindro practicable"]
[null,"UE035YK001","humiSteam Basic 35 kg/h, 230V 3~, ON/OFF or proportional, disposable cylinder","humiSteam Basic 35 kg/h, 230V 3~,  ON/OFF o proporzionale, cilindro non apribile","humiSteam Basic 35 kg/h, 230V 3~, ON/OFF or proportional, disposable cylinder","humiSteam Basic 35 kg/h, 230V 3~, ON/OFF ou proportionnel, cylindre non ouvrant","humiSteam Basic 35 kg/h, 230V 3~, EIN/AUS-Betrieb oder proportional Regelung, Einweg-Dampfzylinder","humiSteam Basic 35 kg/h, 230V 3~,  todo/nada o proporcional, cilindro no practicable"]
[null,"UE035YKC01","humiSteam Basic 35 kg/h, 230V 3~, ON/OFF or proportional, cleanable cylinder","humiSteam Basic 35 kg/h, 230V 3~,  ON/OFF o proporzionale, cilindro apribile","humiSteam Basic 35 kg/h, 230V 3~, ON/OFF or proportional, cleanable cylinder","humiSteam Basic 35 kg/h, 230V 3~, ON/OFF ou proportionnel, cylindre ouvrant","humiSteam Basic 35 kg/h, 230V 3~, EIN/AUS-Betrieb oder proportional Regelung, Reinigungsfähig-Dampfzylinder","humiSteam Basic 35 kg/h, 230V 3~,  todo/nada o proporcional, cilindro practicable"]
[null,"UE035YL001","humiSteam Basic 35 kg/h, 400V 3~, ON/OFF or proportional, disposable cylinder","humiSteam Basic 35 kg/h, 400V 3~,  ON/OFF o proporzionale, cilindro non apribile","humiSteam Basic 35 kg/h, 400V 3~, ON/OFF or proportional, disposable cylinder","humiSteam Basic 35 kg/h, 400V 3~, ON/OFF ou proportionnel, cylindre non ouvrant","humiSteam Basic 35 kg/h, 400V 3~, EIN/AUS-Betrieb oder proportional Regelung, Einweg-Dampfzylinder","humiSteam Basic 35 kg/h, 400V 3~,  todo/nada o proporcional, cilindro no practicable"]
[null,"UE035YLC01","humiSteam Basic 35 kg/h, 400V 3~, ON/OFF or proportional, cleanable cylinder","humiSteam Basic 35 kg/h, 400V 3~,  ON/OFF o proporzionale, cilindro apribile","humiSteam Basic 35 kg/h, 400V 3~, ON/OFF or proportional, cleanable cylinder","humiSteam Basic 35 kg/h, 400V 3~, ON/OFF ou proportionnel, cylindre ouvrant","humiSteam Basic 35 kg/h, 400V 3~, EIN/AUS-Betrieb oder proportional Regelung, Reinigungsfähig-Dampfzylinder","humiSteam Basic 35 kg/h, 400V 3~,  todo/nada o proporcional, cilindro practicable"]
[null,"UE035YM001","humiSteam Basic 35 kg/h, 460V 3~, ON/OFF or proportional, disposable cylinder","humiSteam Basic 35 kg/h, 460V 3~,  ON/OFF o proporzionale, cilindro non apribile","humiSteam Basic 35 kg/h, 460V 3~, ON/OFF or proportional, disposable cylinder","humiSteam Basic 35 kg/h, 460V 3~, ON/OFF ou proportionnel, cylindre non ouvrant","humiSteam Basic 35 kg/h, 460V 3~, EIN/AUS-Betrieb oder proportional Regelung, Einweg-Dampfzylinder","humiSteam Basic 35 kg/h, 460V 3~,  todo/nada o proporcional, cilindro no practicable"]
[null,"UE035YMC01","humiSteam Basic 35 kg/h, 460V 3~, ON/OFF or proportional, cleanable cylinder","humiSteam Basic 35 kg/h, 460V 3~,  ON/OFF o proporzionale, cilindro apribile","humiSteam Basic 35 kg/h, 460V 3~, ON/OFF or proportional, cleanable cylinder","humiSteam Basic 35 kg/h, 460V 3~, ON/OFF ou proportionnel, cylindre ouvrant","humiSteam Basic 35 kg/h, 460V 3~, EIN/AUS-Betrieb oder proportional Regelung, Reinigungsfähig-Dampfzylinder","humiSteam Basic 35 kg/h, 460V 3~,  todo/nada o proporcional, cilindro practicable"]
[null,"UE035YN001","humiSteam Basic 35 kg/h, 575V 3~, ON/OFF or proportional, disposable cylinder","humiSteam Basic 35 kg/h, 575V 3~,  ON/OFF o proporzionale, cilindro non apribile","humiSteam Basic 35 kg/h, 575V 3~, ON/OFF or proportional, disposable cylinder","humiSteam Basic 35 kg/h, 575V 3~, ON/OFF ou proportionnel, cylindre non ouvrant","humiSteam Basic 35 kg/h, 575V 3~, EIN/AUS-Betrieb oder proportional Regelung, Einweg-Dampfzylinder","humiSteam Basic 35 kg/h, 575V 3~,  todo/nada o proporcional, cilindro no practicable"]
[null,"UE035YNC01","humiSteam Basic 35 kg/h, 575V 3~, ON/OFF or proportional, cleanable cylinder","humiSteam Basic 35 kg/h, 575V 3~,  ON/OFF o proporzionale, cilindro apribile","humiSteam Basic 35 kg/h, 575V 3~, ON/OFF or proportional, cleanable cylinder","humiSteam Basic 35 kg/h, 575V 3~, ON/OFF ou proportionnel, cylindre ouvrant","humiSteam Basic 35 kg/h, 575V 3~, EIN/AUS-Betrieb oder proportional Regelung, Reinigungsfähig-Dampfzylinder","humiSteam Basic 35 kg/h, 575V 3~,  todo/nada o proporcional, cilindro practicable"]
[null,"UE035YW001","humiSteam Basic 35 kg/h, 208V 3~, ON/OFF or proportional, disposable cylinder","humiSteam Basic 35 kg/h, 208V 3~,  ON/OFF o proporzionale, cilindro non apribile","humiSteam Basic 35 kg/h, 208V 3~, ON/OFF or proportional, disposable cylinder","humiSteam Basic 35 kg/h, 208V 3~, ON/OFF ou proportionnel, cylindre non ouvrant","humiSteam Basic 35 kg/h, 208V 3~, EIN/AUS-Betrieb oder proportional Regelung, Einweg-Dampfzylinder","humiSteam Basic 35 kg/h, 208V 3~,  todo/nada o proporcional, cilindro no practicable"]
[null,"UE035YWC01","humiSteam Basic 35 kg/h, 208V 3~, ON/OFF or proportional, cleanable cylinder","humiSteam Basic 35 kg/h, 208V 3~,  ON/OFF o proporzionale, cilindro apribile","humiSteam Basic 35 kg/h, 208V 3~, ON/OFF or proportional, cleanable cylinder","humiSteam Basic 35 kg/h, 208V 3~, ON/OFF ou proportionnel, cylindre ouvrant","humiSteam Basic 35 kg/h, 208V 3~, EIN/AUS-Betrieb oder proportional Regelung, Reinigungsfähig-Dampfzylinder","humiSteam Basic 35 kg/h, 208V 3~,  todo/nada o proporcional, cilindro practicable"]
[null,"UE045YK001","humiSteam Basic 45 kg/h, 230V 3~, ON/OFF or proportional, disposable cylinder","humiSteam Basic 45 kg/h, 230V 3~,  ON/OFF o proporzionale, cilindro non apribile","humiSteam Basic 45 kg/h, 230V 3~, ON/OFF or proportional, disposable cylinder","humiSteam Basic 45 kg/h, 230V 3~, ON/OFF ou proportionnel, cylindre non ouvrant","humiSteam Basic 45 kg/h, 230V 3~, EIN/AUS-Betrieb oder proportional Regelung, Einweg-Dampfzylinder","humiSteam Basic 45 kg/h, 230V 3~,  todo/nada o proporcional, cilindro no practicable"]
[null,"UE045YKC01","humiSteam Basic 45 kg/h, 230V 3~, ON/OFF or proportional, cleanable cylinder","humiSteam Basic 45 kg/h, 230V 3~,  ON/OFF o proporzionale, cilindro apribile","humiSteam Basic 45 kg/h, 230V 3~, ON/OFF or proportional, cleanable cylinder","humiSteam Basic 45 kg/h, 230V 3~, ON/OFF ou proportionnel, cylindre ouvrant","humiSteam Basic 45 kg/h, 230V 3~, EIN/AUS-Betrieb oder proportional Regelung, Reinigungsfähig-Dampfzylinder","humiSteam Basic 45 kg/h, 230V 3~,  todo/nada o proporcional, cilindro practicable"]
[null,"UE045YL001","humiSteam Basic 45 kg/h, 400V 3~, ON/OFF or proportional, disposable cylinder","humiSteam Basic 45 kg/h, 400V 3~,  ON/OFF o proporzionale, cilindro non apribile","humiSteam Basic 45 kg/h, 400V 3~, ON/OFF or proportional, disposable cylinder","humiSteam Basic 45 kg/h, 400V 3~, ON/OFF ou proportionnel, cylindre non ouvrant","humiSteam Basic 45 kg/h, 400V 3~, EIN/AUS-Betrieb oder proportional Regelung, Einweg-Dampfzylinder","humiSteam Basic 45 kg/h, 400V 3~,  todo/nada o proporcional, cilindro no practicable"]
[null,"UE045YLC01","humiSteam Basic 45 kg/h, 400V 3~, ON/OFF or proportional, cleanable cylinder","humiSteam Basic 45 kg/h, 400V 3~,  ON/OFF o proporzionale, cilindro apribile","humiSteam Basic 45 kg/h, 400V 3~, ON/OFF or proportional, cleanable cylinder","humiSteam Basic 45 kg/h, 400V 3~, ON/OFF ou proportionnel, cylindre ouvrant","humiSteam Basic 45 kg/h, 400V 3~, EIN/AUS-Betrieb oder proportional Regelung, Reinigungsfähig-Dampfzylinder","humiSteam Basic 45 kg/h, 400V 3~,  todo/nada o proporcional, cilindro practicable"]
[null,"UE045YM001","humiSteam Basic 45 kg/h, 460V 3~, ON/OFF or proportional, disposable cylinder","humiSteam Basic 45 kg/h, 460V 3~,  ON/OFF o proporzionale, cilindro non apribile","humiSteam Basic 45 kg/h, 460V 3~, ON/OFF or proportional, disposable cylinder","humiSteam Basic 45 kg/h, 460V 3~, ON/OFF ou proportionnel, cylindre non ouvrant","humiSteam Basic 45 kg/h, 460V 3~, EIN/AUS-Betrieb oder proportional Regelung, Einweg-Dampfzylinder","humiSteam Basic 45 kg/h, 460V 3~,  todo/nada o proporcional, cilindro no practicable"]
[null,"UE045YMC01","humiSteam Basic 45 kg/h, 460V 3~, ON/OFF or proportional, cleanable cylinder","humiSteam Basic 45 kg/h, 460V 3~,  ON/OFF o proporzionale, cilindro apribile","humiSteam Basic 45 kg/h, 460V 3~, ON/OFF or proportional, cleanable cylinder","humiSteam Basic 45 kg/h, 460V 3~, ON/OFF ou proportionnel, cylindre ouvrant","humiSteam Basic 45 kg/h, 460V 3~, EIN/AUS-Betrieb oder proportional Regelung, Reinigungsfähig-Dampfzylinder","humiSteam Basic 45 kg/h, 460V 3~,  todo/nada o proporcional, cilindro practicable"]
[null,"UE045YN001","humiSteam Basic 45 kg/h, 575V 3~, ON/OFF or proportional, disposable cylinder","humiSteam Basic 45 kg/h, 575V 3~,  ON/OFF o proporzionale, cilindro non apribile","humiSteam Basic 45 kg/h, 575V 3~, ON/OFF or proportional, disposable cylinder","humiSteam Basic 45 kg/h, 575V 3~, ON/OFF ou proportionnel, cylindre non ouvrant","humiSteam Basic 45 kg/h, 575V 3~, EIN/AUS-Betrieb oder proportional Regelung, Einweg-Dampfzylinder","humiSteam Basic 45 kg/h, 575V 3~,  todo/nada o proporcional, cilindro no practicable"]
[null,"UE045YNC01","humiSteam Basic 45 kg/h, 575V 3~, ON/OFF or proportional, cleanable cylinder","humiSteam Basic 45 kg/h, 575V 3~,  ON/OFF o proporzionale, cilindro apribile","humiSteam Basic 45 kg/h, 575V 3~, ON/OFF or proportional, cleanable cylinder","humiSteam Basic 45 kg/h, 575V 3~, ON/OFF ou proportionnel, cylindre ouvrant","humiSteam Basic 45 kg/h, 575V 3~, EIN/AUS-Betrieb oder proportional Regelung, Reinigungsfähig-Dampfzylinder","humiSteam Basic 45 kg/h, 575V 3~,  todo/nada o proporcional, cilindro practicable"]
[null,"UE045YW001","humiSteam Basic 45 kg/h, 208V 3~, ON/OFF or proportional, disposable cylinder","humiSteam Basic 45 kg/h, 208V 3~,  ON/OFF o proporzionale, cilindro non apribile","humiSteam Basic 45 kg/h, 208V 3~, ON/OFF or proportional, disposable cylinder","humiSteam Basic 45 kg/h, 208V 3~, ON/OFF ou proportionnel, cylindre non ouvrant","humiSteam Basic 45 kg/h, 208V 3~, EIN/AUS-Betrieb oder proportional Regelung, Einweg-Dampfzylinder","humiSteam Basic 45 kg/h, 208V 3~,  todo/nada o proporcional, cilindro no practicable"]
[null,"UE045YWC01","humiSteam Basic 45 kg/h, 208V 3~, ON/OFF or proportional, cleanable cylinder","humiSteam Basic 45 kg/h, 208V 3~,  ON/OFF o proporzionale, cilindro apribile","humiSteam Basic 45 kg/h, 208V 3~, ON/OFF or proportional, cleanable cylinder","humiSteam Basic 45 kg/h, 208V 3~, ON/OFF ou proportionnel, cylindre ouvrant","humiSteam Basic 45 kg/h, 208V 3~, EIN/AUS-Betrieb oder proportional Regelung, Reinigungsfähig-Dampfzylinder","humiSteam Basic 45 kg/h, 208V 3~,  todo/nada o proporcional, cilindro practicable"]
[null,"UE065YL001","humiSteam Basic 65 kg/h, 400V 3~, ON/OFF or proportional, disposable cylinder","humiSteam Basic 65 kg/h, 400V 3~,  ON/OFF o proporzionale, cilindro non apribile","humiSteam Basic 65 kg/h, 400V 3~, ON/OFF or proportional, disposable cylinder","humiSteam Basic 65 kg/h, 400V 3~, ON/OFF ou proportionnel, cylindre non ouvrant","humiSteam Basic 65 kg/h, 400V 3~, EIN/AUS-Betrieb oder proportional Regelung, Einweg-Dampfzylinder","humiSteam Basic 65 kg/h, 400V 3~,  todo/nada o proporcional, cilindro no practicable"]
[null,"UE065YLC01","humiSteam Basic 65 kg/h, 400V 3~, ON/OFF or proportional, cleanable cylinder","humiSteam Basic 65 kg/h, 400V 3~,  ON/OFF o proporzionale, cilindro apribile","humiSteam Basic 65 kg/h, 400V 3~, ON/OFF or proportional, cleanable cylinder","humiSteam Basic 65 kg/h, 400V 3~, ON/OFF ou proportionnel, cylindre ouvrant","humiSteam Basic 65 kg/h, 400V 3~, EIN/AUS-Betrieb oder proportional Regelung, Reinigungsfähig-Dampfzylinder","humiSteam Basic 65 kg/h, 400V 3~,  todo/nada o proporcional, cilindro practicable"]
[null,"UE065YM001","humiSteam Basic 65 kg/h, 460V 3~, ON/OFF or proportional, disposable cylinder","humiSteam Basic 65 kg/h, 460V 3~,  ON/OFF o proporzionale, cilindro non apribile","humiSteam Basic 65 kg/h, 460V 3~, ON/OFF or proportional, disposable cylinder","humiSteam Basic 65 kg/h, 460V 3~, ON/OFF ou proportionnel, cylindre non ouvrant","humiSteam Basic 65 kg/h, 460V 3~, EIN/AUS-Betrieb oder proportional Regelung, Einweg-Dampfzylinder","humiSteam Basic 65 kg/h, 460V 3~,  todo/nada o proporcional, cilindro no practicable"]
[null,"UE065YMC01","humiSteam Basic 65 kg/h, 460V 3~, ON/OFF or proportional, cleanable cylinder","humiSteam Basic 65 kg/h, 460V 3~,  ON/OFF o proporzionale, cilindro apribile","humiSteam Basic 65 kg/h, 460V 3~, ON/OFF or proportional, cleanable cylinder","humiSteam Basic 65 kg/h, 460V 3~, ON/OFF ou proportionnel, cylindre ouvrant","humiSteam Basic 65 kg/h, 460V 3~, EIN/AUS-Betrieb oder proportional Regelung, Reinigungsfähig-Dampfzylinder","humiSteam Basic 65 kg/h, 460V 3~,  todo/nada o proporcional, cilindro practicable"]
[null,"UE065YN001","humiSteam Basic 65 kg/h, 575V 3~, ON/OFF or proportional, disposable cylinder","humiSteam Basic 65 kg/h, 575V 3~,  ON/OFF o proporzionale, cilindro non apribile","humiSteam Basic 65 kg/h, 575V 3~, ON/OFF or proportional, disposable cylinder","humiSteam Basic 65 kg/h, 575V 3~, ON/OFF ou proportionnel, cylindre non ouvrant","humiSteam Basic 65 kg/h, 575V 3~, EIN/AUS-Betrieb oder proportional Regelung, Einweg-Dampfzylinder","humiSteam Basic 65 kg/h, 575V 3~,  todo/nada o proporcional, cilindro no practicable"]
[null,"UE065YNC01","humiSteam Basic 65 kg/h, 575V 3~, ON/OFF or proportional, cleanable cylinder","humiSteam Basic 65 kg/h, 575V 3~,  ON/OFF o proporzionale, cilindro apribile","humiSteam Basic 65 kg/h, 575V 3~, ON/OFF or proportional, cleanable cylinder","humiSteam Basic 65 kg/h, 575V 3~, ON/OFF ou proportionnel, cylindre ouvrant","humiSteam Basic 65 kg/h, 575V 3~, EIN/AUS-Betrieb oder proportional Regelung, Reinigungsfähig-Dampfzylinder","humiSteam Basic 65 kg/h, 575V 3~,  todo/nada o proporcional, cilindro practicable"]
[null,"UE001XD001","humiSteam X-plus 1,5 kg/h, 230Vac 1~, with regulation, disposable cylinder","humiSteam X-plus 1,5 kg/h, 230V 1~, regolazione integrata, cilindro non apribile","humiSteam X-plus 1,5 kg/h, 230Vac 1~, with regulation, disposable cylinder","humiSteam X-plus 1,5 kg/h, 230Vac 1~, avec régulateur, cylindre non ouvrant","humiSteam X-plus 1,5 kg/h, 230Vac 1~, mit Feuchte-Regelung, Einweg-Dampfzylinder","humiSteam X-plus 1,5 kg/h, 230V 1~, regulación integrada, cilindro no practicable"]
[null,"UE001XDC01","humiSteam X-plus 1,5 kg/h, 230Vac 1~, with regulation, cleanable cylinder","humiSteam X-plus 1,5 kg/h, 230V 1~, regolazione integrata, cilindro apribile","humiSteam X-plus 1,5 kg/h, 230Vac 1~, with regulation, cleanable cylinder","humiSteam X-plus 1,5 kg/h, 230Vac 1~, avec régulateur, cylindre ouvrant","humiSteam X-plus 1,5 kg/h, 230Vac 1~, mit Feuchte-Regelung, Reinigungsfähig-Dampfzylinder","humiSteam X-plus 1,5 kg/h, 230V 1~, regulación integrada, cilindro practicable"]
[null,"UE001XU001","humiSteam X-plus 1,5 kg/h, 208Vac 1~, with regulation, disposable cylinder","humiSteam X-plus 1,5 kg/h, 208V 1~, regolazione integrata, cilindro non apribile","humiSteam X-plus 1,5 kg/h, 208Vac 1~, with regulation, disposable cylinder","humiSteam X-plus 1,5 kg/h, 208Vac 1~, avec régulateur, cylindre non ouvrant","humiSteam X-plus 1,5 kg/h, 208Vac 1~, mit Feuchte-Regelung, Einweg-Dampfzylinder","humiSteam X-plus 1,5 kg/h, 208V 1~, regulación integrada, cilindro no practicable"]
[null,"UE001XUC01","humiSteam X-plus 1,5 kg/h, 208Vac 1~, with regulation, cleanable cylinder","humiSteam X-plus 1,5 kg/h, 208V 1~, regolazione integrata, cilindro apribile","humiSteam X-plus 1,5 kg/h, 208Vac 1~, with regulation, cleanable cylinder","humiSteam X-plus 1,5 kg/h, 208Vac 1~, avec régulateur, cylindre ouvrant","humiSteam X-plus 1,5 kg/h, 208Vac 1~, mit Feuchte-Regelung, Reinigungsfähig-Dampfzylinder","humiSteam X-plus 1,5 kg/h, 208V 1~, regulación integrada, cilindro practicable"]
[null,"UE003XD001","humiSteam X-plus 3 kg/h, 230Vac 1~, with regulation, disposable cylinder","humiSteam X-plus 3 kg/h, 230V 1~, regolazione integrata, cilindro non apribile","humiSteam X-plus 3 kg/h, 230Vac 1~, with regulation, disposable cylinder","humiSteam X-plus 3 kg/h, 230Vac 1~, avec régulateur, cylindre non ouvrant","humiSteam X-plus 3 kg/h, 230Vac 1~, mit Feuchte-Regelung, Einweg-Dampfzylinder","humiSteam X-plus 3 kg/h, 230V 1~, regulación integrada, cilindro no practicable"]
[null,"UE003XDC01","humiSteam X-plus 3 kg/h, 230Vac 1~, with regulation, cleanable cylinder","humiSteam X-plus 3 kg/h, 230V 1~, regolazione integrata, cilindro apribile","humiSteam X-plus 3 kg/h, 230Vac 1~, with regulation, cleanable cylinder","humiSteam X-plus 3 kg/h, 230Vac 1~, avec régulateur, cylindre ouvrant","humiSteam X-plus 3 kg/h, 230Vac 1~, mit Feuchte-Regelung, Reinigungsfähig-Dampfzylinder","humiSteam X-plus 3 kg/h, 230V 1~, regulación integrada, cilindro practicable"]
[null,"UE003XK001","humiSteam X-plus 3 kg/h, 230Vac 3~, with regulation, disposable cylinder","humiSteam X-plus 3 kg/h, 230V 3~, regolazione integrata, cilindro non apribile","humiSteam X-plus 3 kg/h, 230Vac 3~, with regulation, disposable cylinder","humiSteam X-plus 3 kg/h, 230Vac 3~, avec régulateur, cylindre non ouvrant","humiSteam X-plus 3 kg/h, 230Vac 3~, mit Feuchte-Regelung, Einweg-Dampfzylinder","humiSteam X-plus 3 kg/h, 230V 3~, regulación integrada, cilindro no practicable"]
[null,"UE003XKC01","humiSteam X-plus 3 kg/h, 230Vac 3~, with regulation, cleanable cylinder","humiSteam X-plus 3 kg/h, 230V 3~, regolazione integrata, cilindro apribile","humiSteam X-plus 3 kg/h, 230Vac 3~, with regulation, cleanable cylinder","humiSteam X-plus 3 kg/h, 230Vac 3~, avec régulateur, cylindre ouvrant","humiSteam X-plus 3 kg/h, 230Vac 3~, mit Feuchte-Regelung, Reinigungsfähig-Dampfzylinder","humiSteam X-plus 3 kg/h, 230V 3~, regulación integrada, cilindro practicable"]
[null,"UE003XL001","humiSteam X-plus 3 kg/h, 400Vac 3~, with regulation, disposable cylinder","humiSteam X-plus 3 kg/h, 400V 3~, regolazione integrata, cilindro non apribile","humiSteam X-plus 3 kg/h, 400Vac 3~, with regulation, disposable cylinder","humiSteam X-plus 3 kg/h, 400Vac 3~, avec régulateur, cylindre non ouvrant","humiSteam X-plus 3 kg/h, 400Vac 3~, mit Feuchte-Regelung, Einweg-Dampfzylinder","humiSteam X-plus 3 kg/h, 400V 3~, regulación integrada, cilindro no practicable"]
[null,"UE003XLC01","humiSteam X-plus 3 kg/h, 400Vac 3~, with regulation, cleanable cylinder","humiSteam X-plus 3 kg/h, 400V 3~, regolazione integrata, cilindro apribile","humiSteam X-plus 3 kg/h, 400Vac 3~, with regulation, cleanable cylinder","humiSteam X-plus 3 kg/h, 400Vac 3~, avec régulateur, cylindre ouvrant","humiSteam X-plus 3 kg/h, 400Vac 3~, mit Feuchte-Regelung, Reinigungsfähig-Dampfzylinder","humiSteam X-plus 3 kg/h, 400V 3~, regulación integrada, cilindro practicable"]
[null,"UE003XM001","humiSteam X-plus 3 kg/h, 460Vac 3~, with regulation, disposable cylinder","humiSteam X-plus 3 kg/h, 460V 3~, regolazione integrata, cilindro non apribile","humiSteam X-plus 3 kg/h, 460Vac 3~, with regulation, disposable cylinder","humiSteam X-plus 3 kg/h, 460Vac 3~, avec régulateur, cylindre non ouvrant","humiSteam X-plus 3 kg/h, 460Vac 3~, mit Feuchte-Regelung, Einweg-Dampfzylinder","humiSteam X-plus 3 kg/h, 460V 3~, regulación integrada, cilindro no practicable"]
[null,"UE003XMC01","humiSteam X-plus 3 kg/h, 460Vac 3~, with regulation, cleanable cylinder","humiSteam X-plus 3 kg/h, 460V 3~, regolazione integrata, cilindro apribile","humiSteam X-plus 3 kg/h, 460Vac 3~, with regulation, cleanable cylinder","humiSteam X-plus 3 kg/h, 460Vac 3~, avec régulateur, cylindre ouvrant","humiSteam X-plus 3 kg/h, 460Vac 3~, mit Feuchte-Regelung, Reinigungsfähig-Dampfzylinder","humiSteam X-plus 3 kg/h, 460V 3~, regulación integrada, cilindro practicable"]
[{"$nulls":7},"humiSteam X-plus 3 kg/h, 575V 3~, regulación integrada, cilindro no practicable"]
[{"$nulls":7},"humiSteam X-plus 3 kg/h, 575V 3~, regulación integrada, cilindro practicable"]
[null,"UE003XU001","humiSteam X-plus 3 kg/h, 208Vac 1~, with regulation, disposable cylinder","humiSteam X-plus 3 kg/h, 208V 1~, regolazione integrata, cilindro non apribile","humiSteam X-plus 3 kg/h, 208Vac 1~, with regulation, disposable cylinder","humiSteam X-plus 3 kg/h, 208Vac 1~, avec régulateur, cylindre non ouvrant","humiSteam X-plus 3 kg/h, 208Vac 1~, mit Feuchte-Regelung, Einweg-Dampfzylinder","humiSteam X-plus 3 kg/h, 208V 1~, regulación integrada, cilindro no practicable"]
[null,"UE003XUC01","humiSteam X-plus 3 kg/h, 208Vac 1~, with regulation, cleanable cylinder","humiSteam X-plus 3 kg/h, 208V 1~, regolazione integrata, cilindro apribile","humiSteam X-plus 3 kg/h, 208Vac 1~, with regulation, cleanable cylinder","humiSteam X-plus 3 kg/h, 208Vac 1~, avec régulateur, cylindre ouvrant","humiSteam X-plus 3 kg/h, 208Vac 1~, mit Feuchte-Regelung, Reinigungsfähig-Dampfzylinder","humiSteam X-plus 3 kg/h, 208V 1~, regulación integrada, cilindro practicable"]
[null,"UE003XW001","humiSteam X-plus 3 kg/h, 208Vac 3~, with regulation, disposable cylinder","humiSteam X-plus 3 kg/h, 208V 3~, regolazione integrata, cilindro non apribile","humiSteam X-plus 3 kg/h, 208Vac 3~, with regulation, disposable cylinder","humiSteam X-plus 3 kg/h, 208Vac 3~, avec régulateur, cylindre non ouvrant","humiSteam X-plus 3 kg/h, 208Vac 3~, mit Feuchte-Regelung, Einweg-Dampfzylinder","humiSteam X-plus 3 kg/h, 208V 3~, regulación integrada, cilindro no practicable"]
[null,"UE003XWC01","humiSteam X-plus 3 kg/h, 208Vac 3~, with regulation, cleanable cylinder","humiSteam X-plus 3 kg/h, 208V 3~, regolazione integrata, cilindro apribile","humiSteam X-plus 3 kg/h, 208Vac 3~, with regulation, cleanable cylinder","humiSteam X-plus 3 kg/h, 208Vac 3~, avec régulateur, cylindre ouvrant","humiSteam X-plus 3 kg/h, 208Vac 3~, mit Feuchte-Regelung, Reinigungsfähig-Dampfzylinder","humiSteam X-plus 3 kg/h, 208V 3~, regulación integrada, cilindro practicable"]
[null,"UE005XD001","humiSteam X-plus 5 kg/h, 230Vac 1~, with regulation, disposable cylinder","humiSteam X-plus 5 kg/h, 230V 1~, regolazione integrata, cilindro non apribile","humiSteam X-plus 5 kg/h, 230Vac 1~, with regulation, disposable cylinder","humiSteam X-plus 5 kg/h, 230Vac 1~, avec régulateur, cylindre non ouvrant","humiSteam X-plus 5 kg/h, 230Vac 1~, mit Feuchte-Regelung, Einweg-Dampfzylinder","humiSteam X-plus 5 kg/h, 230V 1~, regulación integrada, cilindro no practicable"]
[null,"UE005XDC01","humiSteam X-plus 5 kg/h, 230Vac 1~, with regulation, cleanable cylinder","humiSteam X-plus 5 kg/h, 230V 1~, regolazione integrata, cilindro apribile","humiSteam X-plus 5 kg/h, 230Vac 1~, with regulation, cleanable cylinder","humiSteam X-plus 5 kg/h, 230Vac 1~, avec régulateur, cylindre ouvrant","humiSteam X-plus 5 kg/h, 230Vac 1~, mit Feuchte-Regelung, Reinigungsfähig-Dampfzylinder","humiSteam X-plus 5 kg/h, 230V 1~, regulación integrada, cilindro practicable"]
[null,"UE005XK001","humiSteam X-plus 5 kg/h, 230Vac 3~, with regulation, disposable cylinder","humiSteam X-plus 5 kg/h, 230V 3~, regolazione integrata, cilindro non apribile","humiSteam X-plus 5 kg/h, 230Vac 3~, with regulation, disposable cylinder","humiSteam X-plus 5 kg/h, 230Vac 3~, avec régulateur, cylindre non ouvrant","humiSteam X-plus 5 kg/h, 230Vac 3~, mit Feuchte-Regelung, Einweg-Dampfzylinder","humiSteam X-plus 5 kg/h, 230V 3~, regulación integrada, cilindro no practicable"]
[null,"UE005XKC01","humiSteam X-plus 5 kg/h, 230Vac 3~, with regulation, cleanable cylinder","humiSteam X-plus 5 kg/h, 230V 3~, regolazione integrata, cilindro apribile","humiSteam X-plus 5 kg/h, 230Vac 3~, with regulation, cleanable cylinder","humiSteam X-plus 5 kg/h, 230Vac 3~, avec régulateur, cylindre ouvrant","humiSteam X-plus 5 kg/h, 230Vac 3~, mit Feuchte-Regelung, Reinigungsfähig-Dampfzylinder","humiSteam X-plus 5 kg/h, 230V 3~, regulación integrada, cilindro practicable"]
[null,"UE005XL001","humiSteam X-plus 5 kg/h, 400Vac 3~, with regulation, disposable cylinder","humiSteam X-plus 5 kg/h, 400V 3~, regolazione integrata, cilindro non apribile","humiSteam X-plus 5 kg/h, 400Vac 3~, with regulation, disposable cylinder","humiSteam X-plus 5 kg/h, 400Vac 3~, avec régulateur, cylindre non ouvrant","humiSteam X-plus 5 kg/h, 400Vac 3~, mit Feuchte-Regelung, Einweg-Dampfzylinder","humiSteam X-plus 5 kg/h, 400V 3~, regulación integrada, cilindro no practicable"]
[null,"UE005XLC01","humiSteam X-plus 5 kg/h, 400Vac 3~, with regulation, cleanable cylinder","humiSteam X-plus 5 kg/h, 400V 3~, regolazione integrata, cilindro apribile","humiSteam X-plus 5 kg/h, 400Vac 3~, with regulation, cleanable cylinder","humiSteam X-plus 5 kg/h, 400Vac 3~, avec régulateur, cylindre ouvrant","humiSteam X-plus 5 kg/h, 400Vac 3~, mit Feuchte-Regelung, Reinigungsfähig-Dampfzylinder","humiSteam X-plus 5 kg/h, 400V 3~, regulación integrada, cilindro practicable"]
[null,"UE005XM001","humiSteam X-plus 5 kg/h, 460Vac 3~, with regulation, disposable cylinder","humiSteam X-plus 5 kg/h, 460V 3~, regolazione integrata, cilindro non apribile","humiSteam X-plus 5 kg/h, 460Vac 3~, with regulation, disposable cylinder","humiSteam X-plus 5 kg/h, 460Vac 3~, avec régulateur, cylindre non ouvrant","humiSteam X-plus 5 kg/h, 460Vac 3~, mit Feuchte-Regelung, Einweg-Dampfzylinder","humiSteam X-plus 5 kg/h, 460V 3~, regulación integrada, cilindro no practicable"]
[null,"UE005XMC01","humiSteam X-plus 5 kg/h, 460Vac 3~, with regulation, cleanable cylinder","humiSteam X-plus 5 kg/h, 460V 3~, regolazione integrata, cilindro apribile","humiSteam X-plus 5 kg/h, 460Vac 3~, with regulation, cleanable cylinder","humiSteam X-plus 5 kg/h, 460Vac 3~, avec régulateur, cylindre ouvrant","humiSteam X-plus 5 kg/h, 460Vac 3~, mit Feuchte-Regelung, Reinigungsfähig-Dampfzylinder","humiSteam X-plus 5 kg/h, 460V 3~, regulación integrada, cilindro practicable"]
[null,"UE005XN001","humiSteam X-plus 5 kg/h, 575Vac 3~, with regulation, disposable cylinder","humiSteam X-plus 5 kg/h, 575V 3~, regolazione integrata, cilindro non apribile","humiSteam X-plus 5 kg/h, 575Vac 3~, with regulation, disposable cylinder","humiSteam X-plus 5 kg/h, 575Vac 3~, avec régulateur, cylindre non ouvrant","humiSteam X-plus 5 kg/h, 575Vac 3~, mit Feuchte-Regelung, Einweg-Dampfzylinder","humiSteam X-plus 5 kg/h, 575V 3~, regulación integrada, cilindro no practicable"]
[null,"UE005XNC01","humiSteam X-plus 5 kg/h, 575Vac 3~, with regulation, cleanable cylinder","humiSteam X-plus 5 kg/h, 575V 3~, regolazione integrata, cilindro apribile","humiSteam X-plus 5 kg/h, 575Vac 3~, with regulation, cleanable cylinder","humiSteam X-plus 5 kg/h, 575Vac 3~, avec régulateur, cylindre ouvrant","humiSteam X-plus 5 kg/h, 575Vac 3~, mit Feuchte-Regelung, Reinigungsfähig-Dampfzylinder","humiSteam X-plus 5 kg/h, 575V 3~, regulación integrada, cilindro practicable"]
[null,"UE005XU001","humiSteam X-plus 5 kg/h, 208Vac 1~, with regulation, disposable cylinder","humiSteam X-plus 5 kg/h, 208V 1~, regolazione integrata, cilindro non apribile","humiSteam X-plus 5 kg/h, 208Vac 1~, with regulation, disposable cylinder","humiSteam X-plus 5 kg/h, 208Vac 1~, avec régulateur, cylindre non ouvrant","humiSteam X-plus 5 kg/h, 208Vac 1~, mit Feuchte-Regelung, Einweg-Dampfzylinder","humiSteam X-plus 5 kg/h, 208V 1~, regulación integrada, cilindro no practicable"]
[null,"UE005XUC01","humiSteam X-plus 5 kg/h, 208Vac 1~, with regulation, cleanable cylinder","humiSteam X-plus 5 kg/h, 208V 1~, regolazione integrata, cilindro apribile","humiSteam X-plus 5 kg/h, 208Vac 1~, with regulation, cleanable cylinder","humiSteam X-plus 5 kg/h, 208Vac 1~, avec régulateur, cylindre ouvrant","humiSteam X-plus 5 kg/h, 208Vac 1~, mit Feuchte-Regelung, Reinigungsfähig-Dampfzylinder","humiSteam X-plus 5 kg/h, 208V 1~, regulación integrada, cilindro practicable"]
[null,"UE005XW001","humiSteam X-plus 5 kg/h, 208Vac 3~, with regulation, disposable cylinder","humiSteam X-plus 5 kg/h, 208V 3~, regolazione integrata, cilindro non apribile","humiSteam X-plus 5 kg/h, 208Vac 3~, with regulation, disposable cylinder","humiSteam X-plus 5 kg/h, 208Vac 3~, avec régulateur, cylindre non ouvrant","humiSteam X-plus 5 kg/h, 208Vac 3~, mit Feuchte-Regelung, Einweg-Dampfzylinder","humiSteam X-plus 5 kg/h, 208V 3~, regulación integrada, cilindro no practicable"]
[null,"UE005XWC01","humiSteam X-plus 5 kg/h, 208Vac 3~, with regulation, cleanable cylinder","humiSteam X-plus 5 kg/h, 208V 3~, regolazione integrata, cilindro apribile","humiSteam X-plus 5 kg/h, 208Vac 3~, with regulation, cleanable cylinder","humiSteam X-plus 5 kg/h, 208Vac 3~, avec régulateur, cylindre ouvrant","humiSteam X-plus 5 kg/h, 208Vac 3~, mit Feuchte-Regelung, Reinigungsfähig-Dampfzylinder","humiSteam X-plus 5 kg/h, 208V 3~, regulación integrada, cilindro practicable"]
[null,"UE008XK001","humiSteam X-plus 8 kg/h, 230Vac 3~, with regulation, disposable cylinder","humiSteam X-plus 8 kg/h, 230V 3~, regolazione integrata, cilindro non apribile","humiSteam X-plus 8 kg/h, 230Vac 3~, with regulation, disposable cylinder","humiSteam X-plus 8 kg/h, 230Vac 3~, avec régulateur, cylindre non ouvrant","humiSteam X-plus 8 kg/h, 230Vac 3~, mit Feuchte-Regelung, Einweg-Dampfzylinder","humiSteam X-plus 8 kg/h, 230V 3~, regulación integrada, cilindro no practicable"]
[null,"UE008XKC01","humiSteam X-plus 8 kg/h, 230Vac 3~, with regulation, cleanable cylinder","humiSteam X-plus 8 kg/h, 230V 3~, regolazione integrata, cilindro apribile","humiSteam X-plus 8 kg/h, 230Vac 3~, with regulation, cleanable cylinder","humiSteam X-plus 8 kg/h, 230Vac 3~, avec régulateur, cylindre ouvrant","humiSteam X-plus 8 kg/h, 230Vac 3~, mit Feuchte-Regelung, Reinigungsfähig-Dampfzylinder","humiSteam X-plus 8 kg/h, 230V 3~, regulación integrada, cilindro practicable"]
[null,"UE008XL001","humiSteam X-plus 8 kg/h, 400Vac 3~, with regulation, disposable cylinder","humiSteam X-plus 8 kg/h, 400V 3~, regolazione integrata, cilindro non apribile","humiSteam X-plus 8 kg/h, 400Vac 3~, with regulation, disposable cylinder","humiSteam X-plus 8 kg/h, 400Vac 3~, avec régulateur, cylindre non ouvrant","humiSteam X-plus 8 kg/h, 400Vac 3~, mit Feuchte-Regelung, Einweg-Dampfzylinder","humiSteam X-plus 8 kg/h, 400V 3~, regulación integrada, cilindro no practicable"]
[null,"UE008XLC01","humiSteam X-plus 8 kg/h, 400Vac 3~, with regulation, cleanable cylinder","humiSteam X-plus 8 kg/h, 400V 3~, regolazione integrata, cilindro apribile","humiSteam X-plus 8 kg/h, 400Vac 3~, with regulation, cleanable cylinder","humiSteam X-plus 8 kg/h, 400Vac 3~, avec régulateur, cylindre ouvrant","humiSteam X-plus 8 kg/h, 400Vac 3~, mit Feuchte-Regelung, Reinigungsfähig-Dampfzylinder","humiSteam X-plus 8 kg/h, 400V 3~, regulación integrada, cilindro practicable"]
[null,"UE008XM001","humiSteam X-plus 8 kg/h, 460Vac 3~, with regulation, disposable cylinder","humiSteam X-plus 8 kg/h, 460V 3~, regolazione integrata, cilindro non apribile","humiSteam X-plus 8 kg/h, 460Vac 3~, with regulation, disposable cylinder","humiSteam X-plus 8 kg/h, 460Vac 3~, avec régulateur, cylindre non ouvrant","humiSteam X-plus 8 kg/h, 460Vac 3~, mit Feuchte-Regelung, Einweg-Dampfzylinder","humiSteam X-plus 8 kg/h, 460V 3~, regulación integrada, cilindro no practicable"]
[null,"UE008XMC01","humiSteam X-plus 8 kg/h, 460Vac 3~, with regulation, cleanable cylinder","humiSteam X-plus 8 kg/h, 460V 3~, regolazione integrata, cilindro apribile","humiSteam X-plus 8 kg/h, 460Vac 3~, with regulation, cleanable cylinder","humiSteam X-plus 8 kg/h, 460Vac 3~, avec régulateur, cylindre ouvrant","humiSteam X-plus 8 kg/h, 460Vac 3~, mit Feuchte-Regelung, Reinigungsfähig-Dampfzylinder","humiSteam X-plus 8 kg/h, 460V 3~, regulación integrada, cilindro practicable"]
[null,"UE008XN001","humiSteam X-plus 8 kg/h, 575Vac 3~, with regulation, disposable cylinder","humiSteam X-plus 8 kg/h, 575V 3~, regolazione integrata, cilindro non apribile","humiSteam X-plus 8 kg/h, 575Vac 3~, with regulation, disposable cylinder","humiSteam X-plus 8 kg/h, 575Vac 3~, avec régulateur, cylindre non ouvrant","humiSteam X-plus 8 kg/h, 575Vac 3~, mit Feuchte-Regelung, Einweg-Dampfzylinder","humiSteam X-plus 8 kg/h, 575V 3~, regulación integrada, cilindro no practicable"]
[null,"UE008XNC01","humiSteam X-plus 8 kg/h, 575Vac 3~, with regulation, cleanable cylinder","humiSteam X-plus 8 kg/h, 575V 3~, regolazione integrata, cilindro apribile","humiSteam X-plus 8 kg/h, 575Vac 3~, with regulation, cleanable cylinder","humiSteam X-plus 8 kg/h, 575Vac 3~, avec régulateur, cylindre ouvrant","humiSteam X-plus 8 kg/h, 575Vac 3~, mit Feuchte-Regelung, Reinigungsfähig-Dampfzylinder","humiSteam X-plus 8 kg/h, 575V 3~, regulación integrada, cilindro practicable"]
[null,"UE008XW001","humiSteam X-plus 8 kg/h, 208Vac 3~, with regulation, disposable cylinder","humiSteam X-plus 8 kg/h, 208V 3~, regolazione integrata, cilindro non apribile","humiSteam X-plus 8 kg/h, 208Vac 3~, with regulation, disposable cylinder","humiSteam X-plus 8 kg/h, 208Vac 3~, avec régulateur, cylindre non ouvrant","humiSteam X-plus 8 kg/h, 208Vac 3~, mit Feuchte-Regelung, Einweg-Dampfzylinder","humiSteam X-plus 8 kg/h, 208V 3~, regulación integrada, cilindro no practicable"]
[null,"UE008XWC01","humiSteam X-plus 8 kg/h, 208Vac 3~, with regulation, cleanable cylinder","humiSteam X-plus 8 kg/h, 208V 3~, regolazione integrata, cilindro apribile","humiSteam X-plus 8 kg/h, 208Vac 3~, with regulation, cleanable cylinder","humiSteam X-plus 8 kg/h, 208Vac 3~, avec régulateur, cylindre ouvrant","humiSteam X-plus 8 kg/h, 208Vac 3~, mit Feuchte-Regelung, Reinigungsfähig-Dampfzylinder","humiSteam X-plus 8 kg/h, 208V 3~, regulación integrada, cilindro practicable"]
[null,"UE009XD001","humiSteam X-plus 9 kg/h, 230Vac 1~, with regulation, disposable cylinder","humiSteam X-plus 9 kg/h, 230V 1~, regolazione integrata, cilindro non apribile","humiSteam X-plus 9 kg/h, 230Vac 1~, with regulation, disposable cylinder","humiSteam X-plus 9 kg/h, 230Vac 1~, avec régulateur, cylindre non ouvrant","humiSteam X-plus 9 kg/h, 230Vac 1~, mit Feuchte-Regelung, Einweg-Dampfzylinder","humiSteam X-plus 9 kg/h, 230V 1~, regulación integrada, cilindro no practicable"]
[null,"UE009XDC01","humiSteam X-plus 9 kg/h, 230Vac 1~, with regulation, cleanable cylinder","humiSteam X-plus 9 kg/h, 230V 1~, regolazione integrata, cilindro apribile","humiSteam X-plus 9 kg/h, 230Vac 1~, with regulation, cleanable cylinder","humiSteam X-plus 9 kg/h, 230Vac 1~, avec régulateur, cylindre ouvrant","humiSteam X-plus 9 kg/h, 230Vac 1~, mit Feuchte-Regelung, Reinigungsfähig-Dampfzylinder","humiSteam X-plus 9 kg/h, 230V 1~, regulación integrada, cilindro practicable"]
[null,"UE009XU001","humiSteam X-plus 9 kg/h, 208Vac 1~, with regulation, disposable cylinder","humiSteam X-plus 9 kg/h, 208V 1~, regolazione integrata, cilindro non apribile","humiSteam X-plus 9 kg/h, 208Vac 1~, with regulation, disposable cylinder","humiSteam X-plus 9 kg/h, 208Vac 1~, avec régulateur, cylindre non ouvrant","humiSteam X-plus 9 kg/h, 208Vac 1~, mit Feuchte-Regelung, Einweg-Dampfzylinder","humiSteam X-plus 9 kg/h, 208V 1~, regulación integrada, cilindro no practicable"]
[null,"UE009XUC01","humiSteam X-plus 9 kg/h, 208Vac 1~, with regulation, cleanable cylinder","humiSteam X-plus 9 kg/h, 208V 1~, regolazione integrata, cilindro apribile","humiSteam X-plus 9 kg/h, 208Vac 1~, with regulation, cleanable cylinder","humiSteam X-plus 9 kg/h, 208Vac 1~, avec régulateur, cylindre ouvrant","humiSteam X-plus 9 kg/h, 208Vac 1~, mit Feuchte-Regelung, Reinigungsfähig-Dampfzylinder","humiSteam X-plus 9 kg/h, 208V 1~, regulación integrada, cilindro practicable"]
[null,"UE010XK001","humiSteam X-plus 10 kg/h, 230Vac 3~, with regulation, disposable cylinder","humiSteam X-plus 10 kg/h, 230V 3~, regolazione integrata, cilindro non apribile","humiSteam X-plus 10 kg/h, 230Vac 3~, with regulation, disposable cylinder","humiSteam X-plus 10 kg/h, 230Vac 3~, avec régulateur, cylindre non ouvrant","humiSteam X-plus 10 kg/h, 230Vac 3~, mit Feuchte-Regelung, Einweg-Dampfzylinder","humiSteam X-plus 10 kg/h, 230V 3~, regulación integrada, cilindro no practicable"]
[null,"UE010XKC01","humiSteam X-plus 10 kg/h, 230Vac 3~, with regulation, cleanable cylinder","humiSteam X-plus 10 kg/h, 230V 3~, regolazione integrata, cilindro apribile","humiSteam X-plus 10 kg/h, 230Vac 3~, with regulation, cleanable cylinder","humiSteam X-plus 10 kg/h, 230Vac 3~, avec régulateur, cylindre ouvrant","humiSteam X-plus 10 kg/h, 230Vac 3~, mit Feuchte-Regelung, Reinigungsfähig-Dampfzylinder","humiSteam X-plus 10 kg/h, 230V 3~, regulación integrada, cilindro practicable"]
[null,"UE010XL001","humiSteam X-plus 10 kg/h, 400Vac 3~, with regulation, disposable cylinder","humiSteam X-plus 10 kg/h, 400V 3~, regolazione integrata, cilindro non apribile","humiSteam X-plus 10 kg/h, 400Vac 3~, with regulation, disposable cylinder","humiSteam X-plus 10 kg/h, 400Vac 3~, avec régulateur, cylindre non ouvrant","humiSteam X-plus 10 kg/h, 400Vac 3~, mit Feuchte-Regelung, Einweg-Dampfzylinder","humiSteam X-plus 10 kg/h, 400V 3~, regulación integrada, cilindro no practicable"]
[null,"UE010XLC01","humiSteam X-plus 10 kg/h, 400Vac 3~, with regulation, cleanable cylinder","humiSteam X-plus 10 kg/h, 400V 3~, regolazione integrata, cilindro apribile","humiSteam X-plus 10 kg/h, 400Vac 3~, with regulation, cleanable cylinder","humiSteam X-plus 10 kg/h, 400Vac 3~, avec régulateur, cylindre ouvrant","humiSteam X-plus 10 kg/h, 400Vac 3~, mit Feuchte-Regelung, Reinigungsfähig-Dampfzylinder","humiSteam X-plus 10 kg/h, 400V 3~, regulación integrada, cilindro practicable"]
[null,"UE010XM001","humiSteam X-plus 10 kg/h, 460Vac 3~, with regulation, disposable cylinder","humiSteam X-plus 10 kg/h, 460V 3~, regolazione integrata, cilindro non apribile","humiSteam X-plus 10 kg/h, 460Vac 3~, with regulation, disposable cylinder","humiSteam X-plus 10 kg/h, 460Vac 3~, avec régulateur, cylindre non ouvrant","humiSteam X-plus 10 kg/h, 460Vac 3~, mit Feuchte-Regelung, Einweg-Dampfzylinder","humiSteam X-plus 10 kg/h, 460V 3~, regulación integrada, cilindro no practicable"]
[null,"UE010XMC01","humiSteam X-plus 10 kg/h, 460Vac 3~, with regulation, cleanable cylinder","humiSteam X-plus 10 kg/h, 460V 3~, regolazione integrata, cilindro apribile","humiSteam X-plus 10 kg/h, 460Vac 3~, with regulation, cleanable cylinder","humiSteam X-plus 10 kg/h, 460Vac 3~, avec régulateur, cylindre ouvrant","humiSteam X-plus 10 kg/h, 460Vac 3~, mit Feuchte-Regelung, Reinigungsfähig-Dampfzylinder","humiSteam X-plus 10 kg/h, 460V 3~, regulación integrada, cilindro practicable"]
[null,"UE010XN001","humiSteam X-plus 10 kg/h, 575Vac 3~, with regulation, disposable cylinder","humiSteam X-plus 10 kg/h, 575V 3~, regolazione integrata, cilindro non apribile","humiSteam X-plus 10 kg/h, 575Vac 3~, with regulation, disposable cylinder","humiSteam X-plus 10 kg/h, 575Vac 3~, avec régulateur, cylindre non ouvrant","humiSteam X-plus 10 kg/h, 575Vac 3~, mit Feuchte-Regelung, Einweg-Dampfzylinder","humiSteam X-plus 10 kg/h, 575V 3~, regulación integrada, cilindro no practicable"]
[null,"UE010XNC01","humiSteam X-plus 10 kg/h, 575Vac 3~, with regulation, cleanable cylinder","humiSteam X-plus 10 kg/h, 575V 3~, regolazione integrata, cilindro apribile","humiSteam X-plus 10 kg/h, 575Vac 3~, with regulation, cleanable cylinder","humiSteam X-plus 10 kg/h, 575Vac 3~, avec régulateur, cylindre ouvrant","humiSteam X-plus 10 kg/h, 575Vac 3~, mit Feuchte-Regelung, Reinigungsfähig-Dampfzylinder","humiSteam X-plus 10 kg/h, 575V 3~, regulación integrada, cilindro practicable"]
[null,"UE010XW001","humiSteam X-plus 10 kg/h, 208Vac 3~, with regulation, disposable cylinder","humiSteam X-plus 10 kg/h, 208V 3~, regolazione integrata, cilindro non apribile","humiSteam X-plus 10 kg/h, 208Vac 3~, with regulation, disposable cylinder","humiSteam X-plus 10 kg/h, 208Vac 3~, avec régulateur, cylindre non ouvrant","humiSteam X-plus 10 kg/h, 208Vac 3~, mit Feuchte-Regelung, Einweg-Dampfzylinder","humiSteam X-plus 10 kg/h, 208V 3~, regulación integrada, cilindro no practicable"]
[null,"UE010XWC01","humiSteam X-plus 10 kg/h, 208Vac 3~, with regulation, cleanable cylinder","humiSteam X-plus 10 kg/h, 208V 3~, regolazione integrata, cilindro apribile","humiSteam X-plus 10 kg/h, 208Vac 3~, with regulation, cleanable cylinder","humiSteam X-plus 10 kg/h, 208Vac 3~, avec régulateur, cylindre ouvrant","humiSteam X-plus 10 kg/h, 208Vac 3~, mit Feuchte-Regelung, Reinigungsfähig-Dampfzylinder","humiSteam X-plus 10 kg/h, 208V 3~, regulación integrada, cilindro practicable"]
[null,"UE015XK001","humiSteam X-plus 15 kg/h, 230Vac 3~, with regulation, disposable cylinder","humiSteam X-plus 15 kg/h, 230V 3~, regolazione integrata, cilindro non apribile","humiSteam X-plus 15 kg/h, 230Vac 3~, with regulation, disposable cylinder","humiSteam X-plus 15 kg/h, 230Vac 3~, avec régulateur, cylindre non ouvrant","humiSteam X-plus 15 kg/h, 230Vac 3~, mit Feuchte-Regelung, Einweg-Dampfzylinder","humiSteam X-plus 15 kg/h, 230V 3~, regulación integrada, cilindro no practicable"]
[null,"UE015XKC01","humiSteam X-plus 15 kg/h, 230Vac 3~, with regulation, cleanable cylinder","humiSteam X-plus 15 kg/h, 230V 3~, regolazione integrata, cilindro apribile","humiSteam X-plus 15 kg/h, 230Vac 3~, with regulation, cleanable cylinder","humiSteam X-plus 15 kg/h, 230Vac 3~, avec régulateur, cylindre ouvrant","humiSteam X-plus 15 kg/h, 230Vac 3~, mit Feuchte-Regelung, Reinigungsfähig-Dampfzylinder","humiSteam X-plus 15 kg/h, 230V 3~, regulación integrada, cilindro practicable"]
[null,"UE015XL001","humiSteam X-plus 15 kg/h, 400Vac 3~, with regulation, disposable cylinder","humiSteam X-plus 15 kg/h, 400V 3~, regolazione integrata, cilindro non apribile","humiSteam X-plus 15 kg/h, 400Vac 3~, with regulation, disposable cylinder","humiSteam X-plus 15 kg/h, 400Vac 3~, avec régulateur, cylindre non ouvrant","humiSteam X-plus 15 kg/h, 400Vac 3~, mit Feuchte-Regelung, Einweg-Dampfzylinder","humiSteam X-plus 15 kg/h, 400V 3~, regulación integrada, cilindro no practicable"]
[null,"UE015XLC01","humiSteam X-plus 15 kg/h, 400Vac 3~, with regulation, cleanable cylinder","humiSteam X-plus 15 kg/h, 400V 3~, regolazione integrata, cilindro apribile","humiSteam X-plus 15 kg/h, 400Vac 3~, with regulation, cleanable cylinder","humiSteam X-plus 15 kg/h, 400Vac 3~, avec régulateur, cylindre ouvrant","humiSteam X-plus 15 kg/h, 400Vac 3~, mit Feuchte-Regelung, Reinigungsfähig-Dampfzylinder","humiSteam X-plus 15 kg/h, 400V 3~, regulación integrada, cilindro practicable"]
[null,"UE015XM001","humiSteam X-plus 15 kg/h, 460Vac 3~, with regulation, disposable cylinder","humiSteam X-plus 15 kg/h, 460V 3~, regolazione integrata, cilindro non apribile","humiSteam X-plus 15 kg/h, 460Vac 3~, with regulation, disposable cylinder","humiSteam X-plus 15 kg/h, 460Vac 3~, avec régulateur, cylindre non ouvrant","humiSteam X-plus 15 kg/h, 460Vac 3~, mit Feuchte-Regelung, Einweg-Dampfzylinder","humiSteam X-plus 15 kg/h, 460V 3~, regulación integrada, cilindro no practicable"]
[null,"UE015XMC01","humiSteam X-plus 15 kg/h, 460Vac 3~, with regulation, cleanable cylinder","humiSteam X-plus 15 kg/h, 460V 3~, regolazione integrata, cilindro apribile","humiSteam X-plus 15 kg/h, 460Vac 3~, with regulation, cleanable cylinder","humiSteam X-plus 15 kg/h, 460Vac 3~, avec régulateur, cylindre ouvrant","humiSteam X-plus 15 kg/h, 460Vac 3~, mit Feuchte-Regelung, Reinigungsfähig-Dampfzylinder","humiSteam X-plus 15 kg/h, 460V 3~, regulación integrada, cilindro practicable"]
[null,"UE015XN001","humiSteam X-plus 15 kg/h, 575Vac 3~, with regulation, disposable cylinder","humiSteam X-plus 15 kg/h, 575V 3~, regolazione integrata, cilindro non apribile","humiSteam X-plus 15 kg/h, 575Vac 3~, with regulation, disposable cylinder","humiSteam X-plus 15 kg/h, 575Vac 3~, avec régulateur, cylindre non ouvrant","humiSteam X-plus 15 kg/h, 575Vac 3~, mit Feuchte-Regelung, Einweg-Dampfzylinder","humiSteam X-plus 15 kg/h, 575V 3~, regulación integrada, cilindro no practicable"]
[null,"UE015XNC01","humiSteam X-plus 15 kg/h, 575Vac 3~, with regulation, cleanable cylinder","humiSteam X-plus 15 kg/h, 575V 3~, regolazione integrata, cilindro apribile","humiSteam X-plus 15 kg/h, 575Vac 3~, with regulation, cleanable cylinder","humiSteam X-plus 15 kg/h, 575Vac 3~, avec régulateur, cylindre ouvrant","humiSteam X-plus 15 kg/h, 575Vac 3~, mit Feuchte-Regelung, Reinigungsfähig-Dampfzylinder","humiSteam X-plus 15 kg/h, 575V 3~, regulación integrada, cilindro practicable"]
[null,"UE015XW001","humiSteam X-plus 15 kg/h, 208Vac 3~, with regulation, disposable cylinder","humiSteam X-plus 15 kg/h, 208V 3~, regolazione integrata, cilindro non apribile","humiSteam X-plus 15 kg/h, 208Vac 3~, with regulation, disposable cylinder","humiSteam X-plus 15 kg/h, 208Vac 3~, avec régulateur, cylindre non ouvrant","humiSteam X-plus 15 kg/h, 208Vac 3~, mit Feuchte-Regelung, Einweg-Dampfzylinder","humiSteam X-plus 15 kg/h, 208V 3~, regulación integrada, cilindro no practicable"]
[null,"UE015XWC01","humiSteam X-plus 15 kg/h, 208Vac 3~, with regulation, cleanable cylinder","humiSteam X-plus 15 kg/h, 208V 3~, regolazione integrata, cilindro apribile","humiSteam X-plus 15 kg/h, 208Vac 3~, with regulation, cleanable cylinder","humiSteam X-plus 15 kg/h, 208Vac 3~, avec régulateur, cylindre ouvrant","humiSteam X-plus 15 kg/h, 208Vac 3~, mit Feuchte-Regelung, Reinigungsfähig-Dampfzylinder","humiSteam X-plus 15 kg/h, 208V 3~, regulación integrada, cilindro practicable"]
[null,"UE018XL001","humiSteam X-plus 18 kg/h, 400Vac 3~, with regulation, disposable cylinder","humiSteam X-plus 18 kg/h, 400V 3~, regolazione integrata, cilindro non apribile","humiSteam X-plus 18 kg/h, 400Vac 3~, with regulation, disposable cylinder","humiSteam X-plus 18 kg/h, 400Vac 3~, avec régulateur, cylindre non ouvrant","humiSteam X-plus 18 kg/h, 400Vac 3~, mit Feuchte-Regelung, Einweg-Dampfzylinder","humiSteam X-plus 18 kg/h, 400V 3~, regulación integrada, cilindro no practicable"]
[null,"UE018XLC01","humiSteam X-plus 18 kg/h, 400Vac 3~, with regulation, cleanable cylinder","humiSteam X-plus 18 kg/h, 400V 3~, regolazione integrata, cilindro apribile","humiSteam X-plus 18 kg/h, 400Vac 3~, with regulation, cleanable cylinder","humiSteam X-plus 18 kg/h, 400Vac 3~, avec régulateur, cylindre ouvrant","humiSteam X-plus 18 kg/h, 400Vac 3~, mit Feuchte-Regelung, Reinigungsfähig-Dampfzylinder","humiSteam X-plus 18 kg/h, 400V 3~, regulación integrada, cilindro practicable"]
[null,"UE018XM001","humiSteam X-plus 18 kg/h, 460Vac 3~, with regulation, disposable cylinder","humiSteam X-plus 18 kg/h, 460V 3~, regolazione integrata, cilindro non apribile","humiSteam X-plus 18 kg/h, 460Vac 3~, with regulation, disposable cylinder","humiSteam X-plus 18 kg/h, 460Vac 3~, avec régulateur, cylindre non ouvrant","humiSteam X-plus 18 kg/h, 460Vac 3~, mit Feuchte-Regelung, Einweg-Dampfzylinder","humiSteam X-plus 18 kg/h, 460V 3~, regulación integrada, cilindro no practicable"]
[null,"UE018XMC01","humiSteam X-plus 18 kg/h, 460Vac 3~, with regulation, cleanable cylinder","humiSteam X-plus 18 kg/h, 460V 3~, regolazione integrata, cilindro apribile","humiSteam X-plus 18 kg/h, 460Vac 3~, with regulation, cleanable cylinder","humiSteam X-plus 18 kg/h, 460Vac 3~, avec régulateur, cylindre ouvrant","humiSteam X-plus 18 kg/h, 460Vac 3~, mit Feuchte-Regelung, Reinigungsfähig-Dampfzylinder","humiSteam X-plus 18 kg/h, 460V 3~, regulación integrada, cilindro practicable"]
[null,"UE018XN001","humiSteam X-plus 18 kg/h, 575Vac 3~, with regulation, disposable cylinder","humiSteam X-plus 18 kg/h, 575V 3~, regolazione integrata, cilindro non apribile","humiSteam X-plus 18 kg/h, 575Vac 3~, with regulation, disposable cylinder","humiSteam X-plus 18 kg/h, 575Vac 3~, avec régulateur, cylindre non ouvrant","humiSteam X-plus 18 kg/h, 575Vac 3~, mit Feuchte-Regelung, Einweg-Dampfzylinder","humiSteam X-plus 18 kg/h, 575V 3~, regulación integrada, cilindro no practicable"]
[null,"UE018XNC01","humiSteam X-plus 18 kg/h, 575Vac 3~, with regulation, cleanable cylinder","humiSteam X-plus 18 kg/h, 575V 3~, regolazione integrata, cilindro apribile","humiSteam X-plus 18 kg/h, 575Vac 3~, with regulation, cleanable cylinder","humiSteam X-plus 18 kg/h, 575Vac 3~, avec régulateur, cylindre ouvrant","humiSteam X-plus 18 kg/h, 575Vac 3~, mit Feuchte-Regelung, Reinigungsfähig-Dampfzylinder","humiSteam X-plus 18 kg/h, 575V 3~, regulación integrada, cilindro practicable"]
[null,"UE025XK001","humiSteam X-plus 25 kg/h, 230Vac 3~, with regulation, disposable cylinder","humiSteam X-plus 25 kg/h, 230V 3~, regolazione integrata, cilindro non apribile","humiSteam X-plus 25 kg/h, 230Vac 3~, with regulation, disposable cylinder","humiSteam X-plus 25 kg/h, 230Vac 3~, avec régulateur, cylindre non ouvrant","humiSteam X-plus 25 kg/h, 230Vac 3~, mit Feuchte-Regelung, Einweg-Dampfzylinder","humiSteam X-plus 25 kg/h, 230V 3~, regulación integrada, cilindro no practicable"]
[null,"UE025XKC01","humiSteam X-plus 25 kg/h, 230Vac 3~, with regulation, cleanable cylinder","humiSteam X-plus 25 kg/h, 230V 3~, regolazione integrata, cilindro apribile","humiSteam X-plus 25 kg/h, 230Vac 3~, with regulation, cleanable cylinder","humiSteam X-plus 25 kg/h, 230Vac 3~, avec régulateur, cylindre ouvrant","humiSteam X-plus 25 kg/h, 230Vac 3~, mit Feuchte-Regelung, Reinigungsfähig-Dampfzylinder","humiSteam X-plus 25 kg/h, 230V 3~, regulación integrada, cilindro practicable"]
[null,"UE025XL001","humiSteam X-plus 25 kg/h, 400Vac 3~, with regulation, disposable cylinder","humiSteam X-plus 25 kg/h, 400V 3~, regolazione integrata, cilindro non apribile","humiSteam X-plus 25 kg/h, 400Vac 3~, with regulation, disposable cylinder","humiSteam X-plus 25 kg/h, 400Vac 3~, avec régulateur, cylindre non ouvrant","humiSteam X-plus 25 kg/h, 400Vac 3~, mit Feuchte-Regelung, Einweg-Dampfzylinder","humiSteam X-plus 25 kg/h, 400V 3~, regulación integrada, cilindro no practicable"]
[null,"UE025XLC01","humiSteam X-plus 25 kg/h, 400Vac 3~, with regulation, cleanable cylinder","humiSteam X-plus 25 kg/h, 400V 3~, regolazione integrata, cilindro apribile","humiSteam X-plus 25 kg/h, 400Vac 3~, with regulation, cleanable cylinder","humiSteam X-plus 25 kg/h, 400Vac 3~, avec régulateur, cylindre ouvrant","humiSteam X-plus 25 kg/h, 400Vac 3~, mit Feuchte-Regelung, Reinigungsfähig-Dampfzylinder","humiSteam X-plus 25 kg/h, 400V 3~, regulación integrada, cilindro practicable"]
[null,"UE025XM001","humiSteam X-plus 25 kg/h, 460Vac 3~, with regulation, disposable cylinder","humiSteam X-plus 25 kg/h, 460V 3~, regolazione integrata, cilindro non apribile","humiSteam X-plus 25 kg/h, 460Vac 3~, with regulation, disposable cylinder","humiSteam X-plus 25 kg/h, 460Vac 3~, avec régulateur, cylindre non ouvrant","humiSteam X-plus 25 kg/h, 460Vac 3~, mit Feuchte-Regelung, Einweg-Dampfzylinder","humiSteam X-plus 25 kg/h, 460V 3~, regulación integrada, cilindro no practicable"]
[null,"UE025XMC01","humiSteam X-plus 25 kg/h, 460Vac 3~, with regulation, cleanable cylinder","humiSteam X-plus 25 kg/h, 460V 3~, regolazione integrata, cilindro apribile","humiSteam X-plus 25 kg/h, 460Vac 3~, with regulation, cleanable cylinder","humiSteam X-plus 25 kg/h, 460Vac 3~, avec régulateur, cylindre ouvrant","humiSteam X-plus 25 kg/h, 460Vac 3~, mit Feuchte-Regelung, Reinigungsfähig-Dampfzylinder","humiSteam X-plus 25 kg/h, 460V 3~, regulación integrada, cilindro practicable"]
[null,"UE025XN001","humiSteam X-plus 25 kg/h, 575Vac 3~, with regulation, disposable cylinder","humiSteam X-plus 25 kg/h, 575V 3~, regolazione integrata, cilindro non apribile","humiSteam X-plus 25 kg/h, 575Vac 3~, with regulation, disposable cylinder","humiSteam X-plus 25 kg/h, 575Vac 3~, avec régulateur, cylindre non ouvrant","humiSteam X-plus 25 kg/h, 575Vac 3~, mit Feuchte-Regelung, Einweg-Dampfzylinder","humiSteam X-plus 25 kg/h, 575V 3~, regulación integrada, cilindro no practicable"]
[null,"UE025XNC01","humiSteam X-plus 25 kg/h, 575Vac 3~, with regulation, cleanable cylinder","humiSteam X-plus 25 kg/h, 575V 3~, regolazione integrata, cilindro apribile","humiSteam X-plus 25 kg/h, 575Vac 3~, with regulation, cleanable cylinder","humiSteam X-plus 25 kg/h, 575Vac 3~, avec régulateur, cylindre ouvrant","humiSteam X-plus 25 kg/h, 575Vac 3~, mit Feuchte-Regelung, Reinigungsfähig-Dampfzylinder","humiSteam X-plus 25 kg/h, 575V 3~, regulación integrada, cilindro practicable"]
[null,"UE025XW001","humiSteam X-plus 25 kg/h, 208Vac 3~, with regulation, disposable cylinder","humiSteam X-plus 25 kg/h, 208V 3~, regolazione integrata, cilindro non apribile","humiSteam X-plus 25 kg/h, 208Vac 3~, with regulation, disposable cylinder","humiSteam X-plus 25 kg/h, 208Vac 3~, avec régulateur, cylindre non ouvrant","humiSteam X-plus 25 kg/h, 208Vac 3~, mit Feuchte-Regelung, Einweg-Dampfzylinder","humiSteam X-plus 25 kg/h, 208V 3~, regulación integrada, cilindro no practicable"]
[null,"UE025XWC01","humiSteam X-plus 25 kg/h, 208Vac 3~, with regulation, cleanable cylinder","humiSteam X-plus 25 kg/h, 208V 3~, regolazione integrata, cilindro apribile","humiSteam X-plus 25 kg/h, 208Vac 3~, with regulation, cleanable cylinder","humiSteam X-plus 25 kg/h, 208Vac 3~, avec régulateur, cylindre ouvrant","humiSteam X-plus 25 kg/h, 208Vac 3~, mit Feuchte-Regelung, Reinigungsfähig-Dampfzylinder","humiSteam X-plus 25 kg/h, 208V 3~, regulación integrada, cilindro practicable"]
[null,"UE035XK001","humiSteam X-plus 35 kg/h, 230Vac 3~, with regulation, disposable cylinder","humiSteam X-plus 35 kg/h, 230V 3~, regolazione integrata, cilindro non apribile","humiSteam X-plus 35 kg/h, 230Vac 3~, with regulation, disposable cylinder","humiSteam X-plus 35 kg/h, 230Vac 3~, avec régulateur, cylindre non ouvrant","humiSteam X-plus 35 kg/h, 230Vac 3~, mit Feuchte-Regelung, Einweg-Dampfzylinder","humiSteam X-plus 35 kg/h, 230V 3~, regulación integrada, cilindro no practicable"]
[null,"UE035XKC01","humiSteam X-plus 35 kg/h, 230Vac 3~, with regulation, cleanable cylinder","humiSteam X-plus 35 kg/h, 230V 3~, regolazione integrata, cilindro apribile","humiSteam X-plus 35 kg/h, 230Vac 3~, with regulation, cleanable cylinder","humiSteam X-plus 35 kg/h, 230Vac 3~, avec régulateur, cylindre ouvrant","humiSteam X-plus 35 kg/h, 230Vac 3~, mit Feuchte-Regelung, Reinigungsfähig-Dampfzylinder","humiSteam X-plus 35 kg/h, 230V 3~, regulación integrada, cilindro practicable"]
[null,"UE035XL001","humiSteam X-plus 35 kg/h, 400Vac 3~, with regulation, disposable cylinder","humiSteam X-plus 35 kg/h, 400V 3~, regolazione integrata, cilindro non apribile","humiSteam X-plus 35 kg/h, 400Vac 3~, with regulation, disposable cylinder","humiSteam X-plus 35 kg/h, 400Vac 3~, avec régulateur, cylindre non ouvrant","humiSteam X-plus 35 kg/h, 400Vac 3~, mit Feuchte-Regelung, Einweg-Dampfzylinder","humiSteam X-plus 35 kg/h, 400V 3~, regulación integrada, cilindro no practicable"]
[null,"UE035XLC01","humiSteam X-plus 35 kg/h, 400Vac 3~, with regulation, cleanable cylinder","humiSteam X-plus 35 kg/h, 400V 3~, regolazione integrata, cilindro apribile","humiSteam X-plus 35 kg/h, 400Vac 3~, with regulation, cleanable cylinder","humiSteam X-plus 35 kg/h, 400Vac 3~, avec régulateur, cylindre ouvrant","humiSteam X-plus 35 kg/h, 400Vac 3~, mit Feuchte-Regelung, Reinigungsfähig-Dampfzylinder","humiSteam X-plus 35 kg/h, 400V 3~, regulación integrada, cilindro practicable"]
[null,"UE035XM001","humiSteam X-plus 35 kg/h, 460Vac 3~, with regulation, disposable cylinder","humiSteam X-plus 35 kg/h, 460V 3~, regolazione integrata, cilindro non apribile","humiSteam X-plus 35 kg/h, 460Vac 3~, with regulation, disposable cylinder","humiSteam X-plus 35 kg/h, 460Vac 3~, avec régulateur, cylindre non ouvrant","humiSteam X-plus 35 kg/h, 460Vac 3~, mit Feuchte-Regelung, Einweg-Dampfzylinder","humiSteam X-plus 35 kg/h, 460V 3~, regulación integrada, cilindro no practicable"]
[null,"UE035XMC01","humiSteam X-plus 35 kg/h, 460Vac 3~, with regulation, cleanable cylinder","humiSteam X-plus 35 kg/h, 460V 3~, regolazione integrata, cilindro apribile","humiSteam X-plus 35 kg/h, 460Vac 3~, with regulation, cleanable cylinder","humiSteam X-plus 35 kg/h, 460Vac 3~, avec régulateur, cylindre ouvrant","humiSteam X-plus 35 kg/h, 460Vac 3~, mit Feuchte-Regelung, Reinigungsfähig-Dampfzylinder","humiSteam X-plus 35 kg/h, 460V 3~, regulación integrada, cilindro practicable"]
[null,"UE035XN001","humiSteam X-plus 35 kg/h, 575Vac 3~, with regulation, disposable cylinder","humiSteam X-plus 35 kg/h, 575V 3~, regolazione integrata, cilindro non apribile","humiSteam X-plus 35 kg/h, 575Vac 3~, with regulation, disposable cylinder","humiSteam X-plus 35 kg/h, 575Vac 3~, avec régulateur, cylindre non ouvrant","humiSteam X-plus 35 kg/h, 575Vac 3~, mit Feuchte-Regelung, Einweg-Dampfzylinder","humiSteam X-plus 35 kg/h, 575V 3~, regulación integrada, cilindro no practicable"]
[null,"UE035XNC01","humiSteam X-plus 35 kg/h, 575Vac 3~, with regulation, cleanable cylinder","humiSteam X-plus 35 kg/h, 575V 3~, regolazione integrata, cilindro apribile","humiSteam X-plus 35 kg/h, 575Vac 3~, with regulation, cleanable cylinder","humiSteam X-plus 35 kg/h, 575Vac 3~, avec régulateur, cylindre ouvrant","humiSteam X-plus 35 kg/h, 575Vac 3~, mit Feuchte-Regelung, Reinigungsfähig-Dampfzylinder","humiSteam X-plus 35 kg/h, 575V 3~, regulación integrada, cilindro practicable"]
[null,"UE035XW001","humiSteam X-plus 35 kg/h, 208Vac 3~, with regulation, disposable cylinder","humiSteam X-plus 35 kg/h, 208V 3~, regolazione integrata, cilindro non apribile","humiSteam X-plus 35 kg/h, 208Vac 3~, with regulation, disposable cylinder","humiSteam X-plus 35 kg/h, 208Vac 3~, avec régulateur, cylindre non ouvrant","humiSteam X-plus 35 kg/h, 208Vac 3~, mit Feuchte-Regelung, Einweg-Dampfzylinder","humiSteam X-plus 35 kg/h, 208V 3~, regulación integrada, cilindro no practicable"]
[null,"UE035XWC01","humiSteam X-plus 35 kg/h, 208Vac 3~, with regulation, cleanable cylinder","humiSteam X-plus 35 kg/h, 208V 3~, regolazione integrata, cilindro apribile","humiSteam X-plus 35 kg/h, 208Vac 3~, with regulation, cleanable cylinder","humiSteam X-plus 35 kg/h, 208Vac 3~, avec régulateur, cylindre ouvrant","humiSteam X-plus 35 kg/h, 208Vac 3~, mit Feuchte-Regelung, Reinigungsfähig-Dampfzylinder","humiSteam X-plus 35 kg/h, 208V 3~, regulación integrada, cilindro practicable"]
[null,"UE045XK001","humiSteam X-plus 45 kg/h, 230Vac 3~, with regulation, disposable cylinder","humiSteam X-plus 45 kg/h, 230V 3~, regolazione integrata, cilindro non apribile","humiSteam X-plus 45 kg/h, 230Vac 3~, with regulation, disposable cylinder","humiSteam X-plus 45 kg/h, 230Vac 3~, avec régulateur, cylindre non ouvrant","humiSteam X-plus 45 kg/h, 230Vac 3~, mit Feuchte-Regelung, Einweg-Dampfzylinder","humiSteam X-plus 45 kg/h, 230V 3~, regulación integrada, cilindro no practicable"]
[null,"UE045XKC01","humiSteam X-plus 45 kg/h, 230Vac 3~, with regulation, cleanable cylinder","humiSteam X-plus 45 kg/h, 230V 3~, regolazione integrata, cilindro apribile","humiSteam X-plus 45 kg/h, 230Vac 3~, with regulation, cleanable cylinder","humiSteam X-plus 45 kg/h, 230Vac 3~, avec régulateur, cylindre ouvrant","humiSteam X-plus 45 kg/h, 230Vac 3~, mit Feuchte-Regelung, Reinigungsfähig-Dampfzylinder","humiSteam X-plus 45 kg/h, 230V 3~, regulación integrada, cilindro practicable"]
[null,"UE045XL001","humiSteam X-plus 45 kg/h, 400Vac 3~, with regulation, disposable cylinder","humiSteam X-plus 45 kg/h, 400V 3~, regolazione integrata, cilindro non apribile","humiSteam X-plus 45 kg/h, 400Vac 3~, with regulation, disposable cylinder","humiSteam X-plus 45 kg/h, 400Vac 3~, avec régulateur, cylindre non ouvrant","humiSteam X-plus 45 kg/h, 400Vac 3~, mit Feuchte-Regelung, Einweg-Dampfzylinder","humiSteam X-plus 45 kg/h, 400V 3~, regulación integrada, cilindro no practicable"]
[null,"UE045XLC01","humiSteam X-plus 45 kg/h, 400Vac 3~, with regulation, cleanable cylinder","humiSteam X-plus 45 kg/h, 400V 3~, regolazione integrata, cilindro apribile","humiSteam X-plus 45 kg/h, 400Vac 3~, with regulation, cleanable cylinder","humiSteam X-plus 45 kg/h, 400Vac 3~, avec régulateur, cylindre ouvrant","humiSteam X-plus 45 kg/h, 400Vac 3~, mit Feuchte-Regelung, Reinigungsfähig-Dampfzylinder","humiSteam X-plus 45 kg/h, 400V 3~, regulación integrada, cilindro practicable"]
[null,"UE045XM001","humiSteam X-plus 45 kg/h, 460Vac 3~, with regulation, disposable cylinder","humiSteam X-plus 45 kg/h, 460V 3~, regolazione integrata, cilindro non apribile","humiSteam X-plus 45 kg/h, 460Vac 3~, with regulation, disposable cylinder","humiSteam X-plus 45 kg/h, 460Vac 3~, avec régulateur, cylindre non ouvrant","humiSteam X-plus 45 kg/h, 460Vac 3~, mit Feuchte-Regelung, Einweg-Dampfzylinder","humiSteam X-plus 45 kg/h, 460V 3~, regulación integrada, cilindro no practicable"]
[null,"UE045XMC01","humiSteam X-plus 45 kg/h, 460Vac 3~, with regulation, cleanable cylinder","humiSteam X-plus 45 kg/h, 460V 3~, regolazione integrata, cilindro apribile","humiSteam X-plus 45 kg/h, 460Vac 3~, with regulation, cleanable cylinder","humiSteam X-plus 45 kg/h, 460Vac 3~, avec régulateur, cylindre ouvrant","humiSteam X-plus 45 kg/h, 460Vac 3~, mit Feuchte-Regelung, Reinigungsfähig-Dampfzylinder","humiSteam X-plus 45 kg/h, 460V 3~, regulación integrada, cilindro practicable"]
[null,"UE045XN001","humiSteam X-plus 45 kg/h, 575Vac 3~, with regulation, disposable cylinder","humiSteam X-plus 45 kg/h, 575V 3~, regolazione integrata, cilindro non apribile","humiSteam X-plus 45 kg/h, 575Vac 3~, with regulation, disposable cylinder","humiSteam X-plus 45 kg/h, 575Vac 3~, avec régulateur, cylindre non ouvrant","humiSteam X-plus 45 kg/h, 575Vac 3~, mit Feuchte-Regelung, Einweg-Dampfzylinder","humiSteam X-plus 45 kg/h, 575V 3~, regulación integrada, cilindro no practicable"]
[null,"UE045XNC01","humiSteam X-plus 45 kg/h, 575Vac 3~, with regulation, cleanable cylinder","humiSteam X-plus 45 kg/h, 575V 3~, regolazione integrata, cilindro apribile","humiSteam X-plus 45 kg/h, 575Vac 3~, with regulation, cleanable cylinder","humiSteam X-plus 45 kg/h, 575Vac 3~, avec régulateur, cylindre ouvrant","humiSteam X-plus 45 kg/h, 575Vac 3~, mit Feuchte-Regelung, Reinigungsfähig-Dampfzylinder","humiSteam X-plus 45 kg/h, 575V 3~, regulación integrada, cilindro practicable"]
[null,"UE045XW001","humiSteam X-plus 45 kg/h, 208Vac 3~, with regulation, disposable cylinder","humiSteam X-plus 45 kg/h, 208V 3~, regolazione integrata, cilindro non apribile","humiSteam X-plus 45 kg/h, 208Vac 3~, with regulation, disposable cylinder","humiSteam X-plus 45 kg/h, 208Vac 3~, avec régulateur, cylindre non ouvrant","humiSteam X-plus 45 kg/h, 208Vac 3~, mit Feuchte-Regelung, Einweg-Dampfzylinder","humiSteam X-plus 45 kg/h, 208V 3~, regulación integrada, cilindro no practicable"]
[null,"UE045XWC01","humiSteam X-plus 45 kg/h, 208Vac 3~, with regulation, cleanable cylinder","humiSteam X-plus 45 kg/h, 208V 3~, regolazione integrata, cilindro apribile","humiSteam X-plus 45 kg/h, 208Vac 3~, with regulation, cleanable cylinder","humiSteam X-plus 45 kg/h, 208Vac 3~, avec régulateur, cylindre ouvrant","humiSteam X-plus 45 kg/h, 208Vac 3~, mit Feuchte-Regelung, Reinigungsfähig-Dampfzylinder","humiSteam X-plus 45 kg/h, 208V 3~, regulación integrada, cilindro practicable"]
[null,"UE065XL001","humiSteam X-plus 65 kg/h, 400Vac 3~, with regulation, disposable cylinder","humiSteam X-plus 65 kg/h, 400V 3~, regolazione integrata, cilindro non apribile","humiSteam X-plus 65 kg/h, 400Vac 3~, with regulation, disposable cylinder","humiSteam X-plus 65 kg/h, 400Vac 3~, avec régulateur, cylindre non ouvrant","humiSteam X-plus 65 kg/h, 400Vac 3~, mit Feuchte-Regelung, Einweg-Dampfzylinder","humiSteam X-plus 65 kg/h, 400V 3~, regulación integrada, cilindro no practicable"]
[null,"UE065XLC01","humiSteam X-plus 65 kg/h, 400Vac 3~, with regulation, cleanable cylinder","humiSteam X-plus 65 kg/h, 400V 3~, regolazione integrata, cilindro apribile","humiSteam X-plus 65 kg/h, 400Vac 3~, with regulation, cleanable cylinder","humiSteam X-plus 65 kg/h, 400Vac 3~, avec régulateur, cylindre ouvrant","humiSteam X-plus 65 kg/h, 400Vac 3~, mit Feuchte-Regelung, Reinigungsfähig-Dampfzylinder","humiSteam X-plus 65 kg/h, 400V 3~, regulación integrada, cilindro practicable"]
[null,"UE065XM001","humiSteam X-plus 65 kg/h, 460Vac 3~, with regulation, disposable cylinder","humiSteam X-plus 65 kg/h, 460V 3~, regolazione integrata, cilindro non apribile","humiSteam X-plus 65 kg/h, 460Vac 3~, with regulation, disposable cylinder","humiSteam X-plus 65 kg/h, 460Vac 3~, avec régulateur, cylindre non ouvrant","humiSteam X-plus 65 kg/h, 460Vac 3~, mit Feuchte-Regelung, Einweg-Dampfzylinder","humiSteam X-plus 65 kg/h, 460V 3~, regulación integrada, cilindro no practicable"]
[null,"UE065XMC01","humiSteam X-plus 65 kg/h, 460Vac 3~, with regulation, cleanable cylinder","humiSteam X-plus 65 kg/h, 460V 3~, regolazione integrata, cilindro apribile","humiSteam X-plus 65 kg/h, 460Vac 3~, with regulation, cleanable cylinder","humiSteam X-plus 65 kg/h, 460Vac 3~, avec régulateur, cylindre ouvrant","humiSteam X-plus 65 kg/h, 460Vac 3~, mit Feuchte-Regelung, Reinigungsfähig-Dampfzylinder","humiSteam X-plus 65 kg/h, 460V 3~, regulación integrada, cilindro practicable"]
[null,"UE065XN001","humiSteam X-plus 65 kg/h, 575Vac 3~, with regulation, disposable cylinder","humiSteam X-plus 65 kg/h, 575V 3~, regolazione integrata, cilindro non apribile","humiSteam X-plus 65 kg/h, 575Vac 3~, with regulation, disposable cylinder","humiSteam X-plus 65 kg/h, 575Vac 3~, avec régulateur, cylindre non ouvrant","humiSteam X-plus 65 kg/h, 575Vac 3~, mit Feuchte-Regelung, Einweg-Dampfzylinder","humiSteam X-plus 65 kg/h, 575V 3~, regulación integrada, cilindro no practicable"]
[null,"UE065XNC01","humiSteam X-plus 65 kg/h, 575Vac 3~, with regulation, cleanable cylinder","humiSteam X-plus 65 kg/h, 575V 3~, regolazione integrata, cilindro apribile","humiSteam X-plus 65 kg/h, 575Vac 3~, with regulation, cleanable cylinder","humiSteam X-plus 65 kg/h, 575Vac 3~, avec régulateur, cylindre ouvrant","humiSteam X-plus 65 kg/h, 575Vac 3~, mit Feuchte-Regelung, Reinigungsfähig-Dampfzylinder","humiSteam X-plus 65 kg/h, 575V 3~, regulación integrada, cilindro practicable"]
[null,"UE090XL001","humiSteam X-plus 90 kg/h, 400Vac 3~, with regulation, disposable cylinder","humiSteam X-plus 90 kg/h, 400V 3~, regolazione integrata, cilindro non apribile","humiSteam X-plus 90 kg/h, 400Vac 3~, with regulation, disposable cylinder","humiSteam X-plus 90 kg/h, 400Vac 3~, avec régulateur, cylindre non ouvrant","humiSteam X-plus 90 kg/h, 400Vac 3~, mit Feuchte-Regelung, Einweg-Dampfzylinder","humiSteam X-plus 90 kg/h, 400V 3~, regulación integrada, cilindro no practicable"]
[null,"UE090XLC01","humiSteam X-plus 90 kg/h, 400Vac 3~, with regulation, cleanable cylinder","humiSteam X-plus 90 kg/h, 400V 3~, regolazione integrata, cilindro apribile","humiSteam X-plus 90 kg/h, 400Vac 3~, with regulation, cleanable cylinder","humiSteam X-plus 90 kg/h, 400Vac 3~, avec régulateur, cylindre ouvrant","humiSteam X-plus 90 kg/h, 400Vac 3~, mit Feuchte-Regelung, Reinigungsfähig-Dampfzylinder","humiSteam X-plus 90 kg/h, 400V 3~, regulación integrada, cilindro practicable"]
[null,"UE090XM001","humiSteam X-plus 90 kg/h, 460Vac 3~, with regulation, disposable cylinder","humiSteam X-plus 90 kg/h, 460V 3~, regolazione integrata, cilindro non apribile","humiSteam X-plus 90 kg/h, 460Vac 3~, with regulation, disposable cylinder","humiSteam X-plus 90 kg/h, 460Vac 3~, avec régulateur, cylindre non ouvrant","humiSteam X-plus 90 kg/h, 460Vac 3~, mit Feuchte-Regelung, Einweg-Dampfzylinder","humiSteam X-plus 90 kg/h, 460V 3~, regulación integrada, cilindro no practicable"]
[null,"UE090XMC01","humiSteam X-plus 90 kg/h, 460Vac 3~, with regulation, cleanable cylinder","humiSteam X-plus 90 kg/h, 460V 3~, regolazione integrata, cilindro apribile","humiSteam X-plus 90 kg/h, 460Vac 3~, with regulation, cleanable cylinder","humiSteam X-plus 90 kg/h, 460Vac 3~, avec régulateur, cylindre ouvrant","humiSteam X-plus 90 kg/h, 460Vac 3~, mit Feuchte-Regelung, Reinigungsfähig-Dampfzylinder","humiSteam X-plus 90 kg/h, 460V 3~, regulación integrada, cilindro practicable"]
[null,"UE090XN001","humiSteam X-plus 90 kg/h, 575Vac 3~, with regulation, disposable cylinder","humiSteam X-plus 90 kg/h, 575V 3~, regolazione integrata, cilindro non apribile","humiSteam X-plus 90 kg/h, 575Vac 3~, with regulation, disposable cylinder","humiSteam X-plus 90 kg/h, 575Vac 3~, avec régulateur, cylindre non ouvrant","humiSteam X-plus 90 kg/h, 575Vac 3~, mit Feuchte-Regelung, Einweg-Dampfzylinder","humiSteam X-plus 90 kg/h, 575V 3~, regulación integrada, cilindro no practicable"]
[null,"UE090XNC01","humiSteam X-plus 90 kg/h, 575Vac 3~, with regulation, cleanable cylinder","humiSteam X-plus 90 kg/h, 575V 3~, regolazione integrata, cilindro apribile","humiSteam X-plus 90 kg/h, 575Vac 3~, with regulation, cleanable cylinder","humiSteam X-plus 90 kg/h, 575Vac 3~, avec régulateur, cylindre ouvrant","humiSteam X-plus 90 kg/h, 575Vac 3~, mit Feuchte-Regelung, Reinigungsfähig-Dampfzylinder","humiSteam X-plus 90 kg/h, 575V 3~, regulación integrada, cilindro practicable"]
[null,"UE130XL001","humiSteam X-plus 130 kg/h, 400Vac 3~, with regulation, disposable cylinder","humiSteam X-plus 130 kg/h, 400V 3~, regolazione integrata, cilindro non apribile","humiSteam X-plus 130 kg/h, 400Vac 3~, with regulation, disposable cylinder","humiSteam X-plus 130 kg/h, 400Vac 3~, avec régulateur, cylindre non ouvrant","humiSteam X-plus 130 kg/h, 400Vac 3~, mit Feuchte-Regelung, Einweg-Dampfzylinder","humiSteam X-plus 130 kg/h, 400V 3~, regulación integrada, cilindro no practicable"]
[null,"UE130XLC01","humiSteam X-plus 130 kg/h, 400Vac 3~, with regulation, cleanable cylinder","humiSteam X-plus 130 kg/h, 400V 3~, regolazione integrata, cilindro apribile","humiSteam X-plus 130 kg/h, 400Vac 3~, with regulation, cleanable cylinder","humiSteam X-plus 130 kg/h, 400Vac 3~, avec régulateur, cylindre ouvrant","humiSteam X-plus 130 kg/h, 400Vac 3~, mit Feuchte-Regelung, Reinigungsfähig-Dampfzylinder","humiSteam X-plus 130 kg/h, 400V 3~, regulación integrada, cilindro practicable"]
[null,"UE130XM001","humiSteam X-plus 130 kg/h, 460Vac 3~, with regulation, disposable cylinder","humiSteam X-plus 130 kg/h, 460V 3~, regolazione integrata, cilindro non apribile","humiSteam X-plus 130 kg/h, 460Vac 3~, with regulation, disposable cylinder","humiSteam X-plus 130 kg/h, 460Vac 3~, avec régulateur, cylindre non ouvrant","humiSteam X-plus 130 kg/h, 460Vac 3~, mit Feuchte-Regelung, Einweg-Dampfzylinder","humiSteam X-plus 130 kg/h, 460V 3~, regulación integrada, cilindro no practicable"]
[null,"UE130XMC01","humiSteam X-plus 130 kg/h, 460Vac 3~, with regulation, cleanable cylinder","humiSteam X-plus 130 kg/h, 460V 3~, regolazione integrata, cilindro apribile","humiSteam X-plus 130 kg/h, 460Vac 3~, with regulation, cleanable cylinder","humiSteam X-plus 130 kg/h, 460Vac 3~, avec régulateur, cylindre ouvrant","humiSteam X-plus 130 kg/h, 460Vac 3~, mit Feuchte-Regelung, Reinigungsfähig-Dampfzylinder","humiSteam X-plus 130 kg/h, 460V 3~, regulación integrada, cilindro practicable"]
[null,"UE130XN001","humiSteam X-plus 130 kg/h, 575Vac 3~, with regulation, disposable cylinder","humiSteam X-plus 130 kg/h, 575V 3~, regolazione integrata, cilindro non apribile","humiSteam X-plus 130 kg/h, 575Vac 3~, with regulation, disposable cylinder","humiSteam X-plus 130 kg/h, 575Vac 3~, avec régulateur, cylindre non ouvrant","humiSteam X-plus 130 kg/h, 575Vac 3~, mit Feuchte-Regelung, Einweg-Dampfzylinder","humiSteam X-plus 130 kg/h, 575V 3~, regulación integrada, cilindro no practicable"]
[null,"UE130XNC01","humiSteam X-plus 130 kg/h, 575Vac 3~, with regulation, cleanable cylinder","humiSteam X-plus 130 kg/h, 575V 3~, regolazione integrata, cilindro apribile","humiSteam X-plus 130 kg/h, 575Vac 3~, with regulation, cleanable cylinder","humiSteam X-plus 130 kg/h, 575Vac 3~, avec régulateur, cylindre ouvrant","humiSteam X-plus 130 kg/h, 575Vac 3~, mit Feuchte-Regelung, Reinigungsfähig-Dampfzylinder","humiSteam X-plus 130 kg/h, 575V 3~, regulación integrada, cilindro practicable"]
[null,"UR002CD002","heaterSteam 2 kg/h , 230Vac 1~, ON/OFF or proportional, basic version","heaterSteam 2 kg/h, 230V 1~,ON/OFF o proporzionale, versione base","heaterSteam 2 kg/h , 230Vac 1~, ON/OFF or proportional, basic version","heaterSteam 2 kg/h , 230Vac 1~, ON/OFF ou proportionnel, version de base","heaterSteam 2 kg/h , 230Vac 1~, EIN/AUS-Betrieb oder proportional Regelung, Grundversion","heaterSteam 2 kg/h, 230V 1~, todo/nada o proporcional, versión básica"]
[null,"UR002CD102","heaterSteam 2 kg/h , 230Vac 1~, ON/OFF or proportional, full optional version","heaterSteam 2 kg/h, 230V 1~, ON/OFF o proporzionale, versione full optional","heaterSteam 2 kg/h , 230Vac 1~, ON/OFF or proportional, full optional version","heaterSteam 2 kg/h , 230Vac 1~, ON/OFF ou proportionnel, version toutes options","heaterSteam 2 kg/h , 230Vac 1~, EIN/AUS-Betrieb oder proportional Regelung, Vollversion","heaterSteam 2 kg/h, 230V 1~, todo/nada o proporcional, versión con todas las opciones"]
[null,"UR002CU002","heaterSteam 2 kg/h , 208Vac 1~, ON/OFF or proportional, basic version","heaterSteam 2 kg/h, 208V 1~, ON/OFF o proporzionale, versione base","heaterSteam 2 kg/h , 208Vac 1~, ON/OFF or proportional, basic version","heaterSteam 2 kg/h , 208Vac 1~, ON/OFF ou proportionnel, version de base","heaterSteam 2 kg/h , 208Vac 1~, EIN/AUS-Betrieb oder proportional Regelung, Grundversion","heaterSteam 2 kg/h, 208V 1~, todo/nada o proporcional, versión básica"]
[null,"UR002CU102","heaterSteam 2 kg/h , 208Vac 1~, ON/OFF or proportional, full optional version","heaterSteam 2 kg/h, 208V 1~, ON/OFF o proporzionale, versione full optional","heaterSteam 2 kg/h , 208Vac 1~, ON/OFF or proportional, full optional version","heaterSteam 2 kg/h , 208Vac 1~, ON/OFF ou proportionnel, version toutes options","heaterSteam 2 kg/h , 208Vac 1~, EIN/AUS-Betrieb oder proportional Regelung, Vollversion","heaterSteam 2 kg/h, 208V 1~, todo/nada o proporcional, versión con todas las opciones"]
[null,"UR002HD003","heaterSteam process, 2 kg/h , 230Vac 1~, with regulation","heaterSteam process, 2 kg/h, 230V 1~,  regolazione integrata","heaterSteam process, 2 kg/h , 230Vac 1~, with regulation","heaterSteam process, 2 kg/h , 230Vac 1~, avec régulateur","heaterSteam process, 2 kg/h , 230Vac 1~, mit Feuchte-Regelung","heaterSteam process, 2 kg/h, 230V 1~, regulación integrada"]
[null,"UR002HD103","heaterSteam 2 kg/h , 230Vac 1~, with regulation, Titanium version","heaterSteam 2 kg/h, 230V 1~, regolazione integrata, versione Titanium","heaterSteam 2 kg/h , 230Vac 1~, with regulation, Titanium version","heaterSteam 2 kg/h , 230Vac 1~, avec régulateur, version Titanium","heaterSteam 2 kg/h , 230Vac 1~, mit Feuchte-Regelung, Titanium","heaterSteam 2 kg/h, 230V 1~, regulación integrada, versión Titanium"]
[null,"UR002HU002","heaterSteam 2 kg/h , 208Vac 1~, with regulation, basic version","heaterSteam 2 kg/h, 208V 1~, regolazione integrata, versione base","heaterSteam 2 kg/h , 208Vac 1~, with regulation, basic version","heaterSteam 2 kg/h , 208Vac 1~, avec régulateur, version de base","heaterSteam 2 kg/h , 208Vac 1~, mit Feuchte-Regelung, Grundversion","heaterSteam 2 kg/h, 208V 1~, regulación integrada, versión básica"]
[null,"UR002HU102","heaterSteam 2 kg/h , 208Vac 1~, with regulation, full optional version","heaterSteam 2 kg/h, 208V 1~, regolazione integrata, versione full optional","heaterSteam 2 kg/h , 208Vac 1~, with regulation, full optional version","heaterSteam 2 kg/h , 208Vac 1~, avec régulateur, version toutes options","heaterSteam 2 kg/h , 208Vac 1~, mit Feuchte-Regelung, Vollversion","heaterSteam 2 kg/h, 208V 1~, regulación integrada, versión con todas las opciones"]
[null,"UR004CD002","heaterSteam 4 kg/h , 230Vac 1~, ON/OFF or proportional, basic version","heaterSteam 4 kg/h, 230V 1~, ON/OFF o proporzionale, versione base","heaterSteam 4 kg/h , 230Vac 1~, ON/OFF or proportional, basic version","heaterSteam 4 kg/h , 230Vac 1~, ON/OFF ou proportionnel, version de base","heaterSteam 4 kg/h , 230Vac 1~, EIN/AUS-Betrieb oder proportional Regelung, Grundversion","heaterSteam 4 kg/h, 230V 1~, todo/nada o proporcional, versión básica"]
[null,"UR004CD102","heaterSteam 4 kg/h , 230Vac 1~, ON/OFF or proportional, full optional version","heaterSteam 4 kg/h, 230V 1~, ON/OFF o proporzionale, versione full optional","heaterSteam 4 kg/h , 230Vac 1~, ON/OFF or proportional, full optional version","heaterSteam 4 kg/h , 230Vac 1~, ON/OFF ou proportionnel, version toutes options","heaterSteam 4 kg/h , 230Vac 1~, EIN/AUS-Betrieb oder proportional Regelung, Vollversion","heaterSteam 4 kg/h, 230V 1~, todo/nada o proporcional, versión con todas las opciones"]
[null,"UR004CU002","heaterSteam 4 kg/h , 208Vac 1~, ON/OFF or proportional, basic version","heaterSteam 4 kg/h, 208V 1~, ON/OFF o proporzionale, versione base","heaterSteam 4 kg/h , 208Vac 1~, ON/OFF or proportional, basic version","heaterSteam 4 kg/h , 208Vac 1~, ON/OFF ou proportionnel, version de base","heaterSteam 4 kg/h , 208Vac 1~, EIN/AUS-Betrieb oder proportional Regelung, Grundversion","heaterSteam 4 kg/h, 208V 1~, todo/nada o proporcional, versión básica"]
[null,"UR004CU102","heaterSteam 4 kg/h , 208Vac 1~, ON/OFF or proportional, full optional version","heaterSteam 4 kg/h, 208V 1~, ON/OFF o proporzionale, versione full optional","heaterSteam 4 kg/h , 208Vac 1~, ON/OFF or proportional, full optional version","heaterSteam 4 kg/h , 208Vac 1~, ON/OFF ou proportionnel, version toutes options","heaterSteam 4 kg/h , 208Vac 1~, EIN/AUS-Betrieb oder proportional Regelung, Vollversion","heaterSteam 4 kg/h, 208V 1~, todo/nada o proporcional, versión con todas las opciones"]
[null,"UR004HD003","heaterSteam process, 4 kg/h , 230Vac 1~, with regulation","heaterSteam process, 4 kg/h, 230V 1~, regolazione integrata","heaterSteam process, 4 kg/h , 230Vac 1~, with regulation","heaterSteam process, 4 kg/h , 230Vac 1~, avec régulateur","heaterSteam process, 4 kg/h , 230Vac 1~, mit Feuchte-Regelung","heaterSteam process, 4 kg/h, 230V 1~, regulación integrada"]
[null,"UR004HD103","heaterSteam 4 kg/h , 230Vac 1~, with regulation, Titanium version","heaterSteam 4 kg/h, 230V 1~, regolazione integrata, versione Titanium","heaterSteam 4 kg/h , 230Vac 1~, with regulation, Titanium version","heaterSteam 4 kg/h , 230Vac 1~, avec régulateur, version Titanium","heaterSteam 4 kg/h , 230Vac 1~, mit Feuchte-Regelung, Titanium","heaterSteam 4 kg/h, 230V 1~, regulación integrada, versión Titanium"]
[null,"UR004HU002","heaterSteam 4 kg/h , 208Vac 1~, with regulation, basic version","heaterSteam 4 kg/h, 208V 1~, regolazione integrata, versione base","heaterSteam 4 kg/h , 208Vac 1~, with regulation, basic version","heaterSteam 4 kg/h , 208Vac 1~, avec régulateur, version de base","heaterSteam 4 kg/h , 208Vac 1~, mit Feuchte-Regelung, Grundversion","heaterSteam 4 kg/h, 208V 1~, regulación integrada, versión básica"]
[null,"UR004HU102","heaterSteam 4 kg/h , 208Vac 1~, with regulation, full optional version","heaterSteam 4 kg/h, 208V 1~, regolazione integrata, versione full optional","heaterSteam 4 kg/h , 208Vac 1~, with regulation, full optional version","heaterSteam 4 kg/h , 208Vac 1~, avec régulateur, version toutes options","heaterSteam 4 kg/h , 208Vac 1~, mit Feuchte-Regelung, Vollversion","heaterSteam 4 kg/h, 208V 1~, regulación integrada, versión con todas las opciones"]
[null,"UR006CD002","heaterSteam 6 kg/h , 230Vac 1~, ON/OFF or proportional, basic version","heaterSteam 6 kg/h, 230V 1~, ON/OFF o proporzionale, versione base","heaterSteam 6 kg/h , 230Vac 1~, ON/OFF or proportional, basic version","heaterSteam 6 kg/h , 230Vac 1~, ON/OFF ou proportionnel, version de base","heaterSteam 6 kg/h , 230Vac 1~, EIN/AUS-Betrieb oder proportional Regelung, Grundversion","heaterSteam 6 kg/h, 230V 1~, todo/nada o proporcional, versión básica"]
[null,"UR006CD102","heaterSteam 6 kg/h , 230Vac 1~, ON/OFF or proportional, full optional version","heaterSteam 6 kg/h, 230V 1~, ON/OFF o proporzionale, versione full optional","heaterSteam 6 kg/h , 230Vac 1~, ON/OFF or proportional, full optional version","heaterSteam 6 kg/h , 230Vac 1~, ON/OFF ou proportionnel, version toutes options","heaterSteam 6 kg/h , 230Vac 1~, EIN/AUS-Betrieb oder proportional Regelung, Vollversion","heaterSteam 6 kg/h, 230V 1~, todo/nada o proporcional, versión con todas las opciones"]
[null,"UR006CK002","heaterSteam 6 kg/h , 230Vac 3~, ON/OFF or proportional, basic version","heaterSteam 6 kg/h, 230V 3~, ON/OFF o proporzionale, versione base","heaterSteam 6 kg/h , 230Vac 3~, ON/OFF or proportional, basic version","heaterSteam 6 kg/h , 230Vac 3~, ON/OFF ou proportionnel, version de base","heaterSteam 6 kg/h , 230Vac 3~, EIN/AUS-Betrieb oder proportional Regelung, Grundversion","heaterSteam 6 kg/h, 230V 3~, todo/nada o proporcional, versión básica"]
[null,"UR006CK102","heaterSteam 6 kg/h , 230Vac 3~, ON/OFF or proportional, full optional version","heaterSteam 6 kg/h, 230V 3~, ON/OFF o proporzionale, versione full optional","heaterSteam 6 kg/h , 230Vac 3~, ON/OFF or proportional, full optional version","heaterSteam 6 kg/h , 230Vac 3~, ON/OFF ou proportionnel, version toutes options","heaterSteam 6 kg/h , 230Vac 3~, EIN/AUS-Betrieb oder proportional Regelung, Vollversion","heaterSteam 6 kg/h, 230V 3~, todo/nada o proporcional, versión con todas las opciones"]
[null,"UR006CL002","heaterSteam 6 kg/h , 400Vac 3~, ON/OFF or proportional, basic version","heaterSteam 6 kg/h, 400V 3~, ON/OFF o proporzionale, versione base","heaterSteam 6 kg/h , 400Vac 3~, ON/OFF or proportional, basic version","heaterSteam 6 kg/h , 400Vac 3~, ON/OFF ou proportionnel, version de base","heaterSteam 6 kg/h , 400Vac 3~, EIN/AUS-Betrieb oder proportional Regelung, Grundversion","heaterSteam 6 kg/h, 400V 3~, todo/nada o proporcional, versión básica"]
[null,"UR006CL102","heaterSteam 6 kg/h , 400Vac 3~, ON/OFF or proportional, full optional version","heaterSteam 6 kg/h, 400V 3~, ON/OFF o proporzionale, versione full optional","heaterSteam 6 kg/h , 400Vac 3~, ON/OFF or proportional, full optional version","heaterSteam 6 kg/h , 400Vac 3~, ON/OFF ou proportionnel, version toutes options","heaterSteam 6 kg/h , 400Vac 3~, EIN/AUS-Betrieb oder proportional Regelung, Vollversion","heaterSteam 6 kg/h, 400V 3~, todo/nada o proporcional, versión con todas las opciones"]
[null,"UR006CM002","heaterSteam 6 kg/h , 460Vac 3~, ON/OFF or proportional, basic version","heaterSteam 6 kg/h, 460V 3~, ON/OFF o proporzionale, versione base","heaterSteam 6 kg/h , 460Vac 3~, ON/OFF or proportional, basic version","heaterSteam 6 kg/h , 460Vac 3~, ON/OFF ou proportionnel, version de base","heaterSteam 6 kg/h , 460Vac 3~, EIN/AUS-Betrieb oder proportional Regelung, Grundversion","heaterSteam 6 kg/h, 460V 3~, todo/nada o proporcional, versión básica"]
[null,"UR006CM102","heaterSteam 6 kg/h , 460Vac 3~, ON/OFF or proportional, full optional version","heaterSteam 6 kg/h, 460V 3~, ON/OFF o proporzionale, versione full optional","heaterSteam 6 kg/h , 460Vac 3~, ON/OFF or proportional, full optional version","heaterSteam 6 kg/h , 460Vac 3~, ON/OFF ou proportionnel, version toutes options","heaterSteam 6 kg/h , 460Vac 3~, EIN/AUS-Betrieb oder proportional Regelung, Vollversion","heaterSteam 6 kg/h, 460V 3~, todo/nada o proporcional, versión con todas las opciones"]
[null,"UR006CN002","heaterSteam 6 kg/h , 575Vac 3~, ON/OFF or proportional, basic version","heaterSteam 6 kg/h, 575V 3~, ON/OFF o proporzionale, versione base","heaterSteam 6 kg/h , 575Vac 3~, ON/OFF or proportional, basic version","heaterSteam 6 kg/h , 575Vac 3~, ON/OFF ou proportionnel, version de base","heaterSteam 6 kg/h , 575Vac 3~, EIN/AUS-Betrieb oder proportional Regelung, Grundversion","heaterSteam 6 kg/h, 575V 3~, todo/nada o proporcional, versión básica"]
[null,"UR006CN102","heaterSteam 6 kg/h , 575Vac 3~, ON/OFF or proportional, full optional version","heaterSteam 6 kg/h, 575V 3~, ON/OFF o proporzionale, versione full optional","heaterSteam 6 kg/h , 575Vac 3~, ON/OFF or proportional, full optional version","heaterSteam 6 kg/h , 575Vac 3~, ON/OFF ou proportionnel, version toutes options","heaterSteam 6 kg/h , 575Vac 3~, EIN/AUS-Betrieb oder proportional Regelung, Vollversion","heaterSteam 6 kg/h, 575V 3~, todo/nada o proporcional, versión con todas las opciones"]
[null,"UR006CU002","heaterSteam 6 kg/h , 208Vac 1~, ON/OFF or proportional, basic version","heaterSteam 6 kg/h, 208V 1~, ON/OFF o proporzionale, versione base","heaterSteam 6 kg/h , 208Vac 1~, ON/OFF or proportional, basic version","heaterSteam 6 kg/h , 208Vac 1~, ON/OFF ou proportionnel, version de base","heaterSteam 6 kg/h , 208Vac 1~, EIN/AUS-Betrieb oder proportional Regelung, Grundversion","heaterSteam 6 kg/h, 208V 1~, todo/nada o proporcional, versión básica"]
[null,"UR006CU102","heaterSteam 6 kg/h , 208Vac 1~, ON/OFF or proportional, full optional version","heaterSteam 6 kg/h, 208V 1~, ON/OFF o proporzionale, versione full optional","heaterSteam 6 kg/h , 208Vac 1~, ON/OFF or proportional, full optional version","heaterSteam 6 kg/h , 208Vac 1~, ON/OFF ou proportionnel, version toutes options","heaterSteam 6 kg/h , 208Vac 1~, EIN/AUS-Betrieb oder proportional Regelung, Vollversion","heaterSteam 6 kg/h, 208V 1~, todo/nada o proporcional, versión con todas las opciones"]
[null,"UR006CW002","heaterSteam 6 kg/h , 208Vac 3~, ON/OFF or proportional, basic version","heaterSteam 6 kg/h, 208V 3~, ON/OFF o proporzionale, versione base","heaterSteam 6 kg/h , 208Vac 3~, ON/OFF or proportional, basic version","heaterSteam 6 kg/h , 208Vac 3~, ON/OFF ou proportionnel, version de base","heaterSteam 6 kg/h , 208Vac 3~, EIN/AUS-Betrieb oder proportional Regelung, Grundversion","heaterSteam 6 kg/h, 208V 3~, todo/nada o proporcional, versión básica"]
[null,"UR006CW102","heaterSteam 6 kg/h , 208Vac 3~, ON/OFF or proportional, full optional version","heaterSteam 6 kg/h, 208V 3~, ON/OFF o proporzionale, versione full optional","heaterSteam 6 kg/h , 208Vac 3~, ON/OFF or proportional, full optional version","heaterSteam 6 kg/h , 208Vac 3~, ON/OFF ou proportionnel, version toutes options","heaterSteam 6 kg/h , 208Vac 3~, EIN/AUS-Betrieb oder proportional Regelung, Vollversion","heaterSteam 6 kg/h, 208V 3~, todo/nada o proporcional, versión con todas las opciones"]
[null,"UR006HD003","heaterSteam process, 6 kg/h , 230Vac 1~, with regulationn","heaterSteam process, 6 kg/h, 230V 1~, regolazione integrata","heaterSteam process, 6 kg/h , 230Vac 1~, with regulationn","heaterSteam process, 6 kg/h , 230Vac 1~, avec régulateur","heaterSteam process, 6 kg/h , 230Vac 1~, mit Feuchte-Regelung","heaterSteam process, 6 kg/h, 230V 1~, regulación integrada"]
[null,"UR006HD103","heaterSteam 6 kg/h , 230Vac 1~, with regulation, Titanium version","heaterSteam 6 kg/h, 230V 1~, regolazione integrata, versione Titanium","heaterSteam 6 kg/h , 230Vac 1~, with regulation, Titanium version","heaterSteam 6 kg/h , 230Vac 1~, avec régulateur, version Titanium","heaterSteam 6 kg/h , 230Vac 1~, mit Feuchte-Regelung, Titanium","heaterSteam 6 kg/h, 230V 1~, regulación integrada, versión Titanium"]
[null,"UR006HK003","heaterSteam process, 6 kg/h , 230Vac 3~, with regulation","heaterSteam process, 6 kg/h, 230V 3~, regolazione integrata","heaterSteam process, 6 kg/h , 230Vac 3~, with regulation","heaterSteam process, 6 kg/h , 230Vac 3~, avec régulateur","heaterSteam process, 6 kg/h , 230Vac 3~, mit Feuchte-Regelung","heaterSteam process, 6 kg/h, 230V 3~, regulación integrada"]
[null,"UR006HK103","heaterSteam 6 kg/h , 230Vac 3~, with regulation, Titanium version","heaterSteam 6 kg/h, 230V 3~, regolazione integrata, versione Titanium","heaterSteam 6 kg/h , 230Vac 3~, with regulation, Titanium version","heaterSteam 6 kg/h , 230Vac 3~, avec régulateur, version Titanium","heaterSteam 6 kg/h , 230Vac 3~, mit Feuchte-Regelung, Titanium","heaterSteam 6 kg/h, 230V 3~, regulación integrada, versión Titanium"]
[null,"UR006HL003","heaterSteam process, 6 kg/h , 400Vac 3~, with regulation","heaterSteam process, 6 kg/h, 400V 3~, regolazione integrata","heaterSteam process, 6 kg/h , 400Vac 3~, with regulation","heaterSteam process, 6 kg/h , 400Vac 3~, avec régulateur","heaterSteam process, 6 kg/h , 400Vac 3~, mit Feuchte-Regelung","heaterSteam process, 6 kg/h, 400V 3~, regulación integrada"]
[null,"UR006HL103","heaterSteam 6 kg/h , 400Vac 3~, with regulation, Titanium version","heaterSteam 6 kg/h, 400V 3~, regolazione integrata, versione Titanium","heaterSteam 6 kg/h , 400Vac 3~, with regulation, Titanium version","heaterSteam 6 kg/h , 400Vac 3~, avec régulateur, version Titanium","heaterSteam 6 kg/h , 400Vac 3~, mit Feuchte-Regelung, Titanium","heaterSteam 6 kg/h, 400V 3~, regulación integrada, versión Titanium"]
[null,"UR006HM003","heaterSteam process, 6 kg/h , 460Vac 3~, with regulation","heaterSteam process, 6 kg/h, 460V 3~, regolazione integrata","heaterSteam process, 6 kg/h , 460Vac 3~, with regulation","heaterSteam process, 6 kg/h , 460Vac 3~, avec régulateur","heaterSteam process, 6 kg/h , 460Vac 3~, mit Feuchte-Regelung","heaterSteam process, 6 kg/h, 460V 3~, regulación integrada"]
[null,"UR006HM103","heaterSteam 6 kg/h , 460Vac 3~, with regulation, Titanium version","heaterSteam 6 kg/h, 460V 3~, regolazione integrata, versione Titanium","heaterSteam 6 kg/h , 460Vac 3~, with regulation, Titanium version","heaterSteam 6 kg/h , 460Vac 3~, avec régulateur, version Titanium","heaterSteam 6 kg/h , 460Vac 3~, mit Feuchte-Regelung, Titanium","heaterSteam 6 kg/h, 460V 3~, regulación integrada, versión Titanium"]
[null,"UR006HN002","heaterSteam 6 kg/h , 575Vac 3~, with regulation, basic version","heaterSteam 6 kg/h, 575V 3~, regolazione integrata, versione base","heaterSteam 6 kg/h , 575Vac 3~, with regulation, basic version","heaterSteam 6 kg/h , 575Vac 3~, avec régulateur, version de base","heaterSteam 6 kg/h , 575Vac 3~, mit Feuchte-Regelung, Grundversion","heaterSteam 6 kg/h, 575V 3~, regulación integrada, versión básica"]
[null,"UR006HN102","heaterSteam 6 kg/h , 575Vac 3~, with regulation, full optional version","heaterSteam 6 kg/h, 575V 3~, regolazione integrata, versione full optional","heaterSteam 6 kg/h , 575Vac 3~, with regulation, full optional version","heaterSteam 6 kg/h , 575Vac 3~, avec régulateur, version toutes options","heaterSteam 6 kg/h , 575Vac 3~, mit Feuchte-Regelung, Vollversion","heaterSteam 6 kg/h, 575V 3~, regulación integrada, versión con todas las opciones"]
[null,"UR006HU002","heaterSteam 6 kg/h , 208Vac 1~, with regulation, basic version","heaterSteam 6 kg/h, 208V 1~, regolazione integrata, versione base","heaterSteam 6 kg/h , 208Vac 1~, with regulation, basic version","heaterSteam 6 kg/h , 208Vac 1~, avec régulateur, version de base","heaterSteam 6 kg/h , 208Vac 1~, mit Feuchte-Regelung, Grundversion","heaterSteam 6 kg/h, 208V 1~, regulación integrada, versión básica"]
[null,"UR006HU102","heaterSteam 6 kg/h , 208Vac 1~, with regulation, full optional version","heaterSteam 6 kg/h, 208V 1~, regolazione integrata, versione full optional","heaterSteam 6 kg/h , 208Vac 1~, with regulation, full optional version","heaterSteam 6 kg/h , 208Vac 1~, avec régulateur, version toutes options","heaterSteam 6 kg/h , 208Vac 1~, mit Feuchte-Regelung, Vollversion","heaterSteam 6 kg/h, 208V 1~, regulación integrada, versión con todas las opciones"]
[null,"UR006HW002","heaterSteam 6 kg/h , 208Vac 3~, with regulation, basic version","heaterSteam 6 kg/h, 208V 3~, regolazione integrata, versione base","heaterSteam 6 kg/h , 208Vac 3~, with regulation, basic version","heaterSteam 6 kg/h , 208Vac 3~, avec régulateur, version de base","heaterSteam 6 kg/h , 208Vac 3~, mit Feuchte-Regelung, Grundversion","heaterSteam 6 kg/h, 208V 3~, regulación integrada, versión básica"]
[null,"UR006HW102","heaterSteam 6 kg/h , 208Vac 3~, with regulation, full optional version","heaterSteam 6 kg/h, 208V 3~, regolazione integrata, versione full optional","heaterSteam 6 kg/h , 208Vac 3~, with regulation, full optional version","heaterSteam 6 kg/h , 208Vac 3~, avec régulateur, version toutes options","heaterSteam 6 kg/h , 208Vac 3~, mit Feuchte-Regelung, Vollversion","heaterSteam 6 kg/h, 208V 3~, regulación integrada, versión con todas las opciones"]
[null,"UR010CK002","heaterSteam 10 kg/h , 230Vac 3~, ON/OFF or proportional, basic version","heaterSteam 10 kg/h, 230V 3~, ON/OFF o proporzionale, versione base","heaterSteam 10 kg/h , 230Vac 3~, ON/OFF or proportional, basic version","heaterSteam 10 kg/h , 230Vac 3~, ON/OFF ou proportionnel, version de base","heaterSteam 10 kg/h , 230Vac 3~, EIN/AUS-Betrieb oder proportional Regelung, Grundversion","heaterSteam 10 kg/h, 230V 3~, todo/nada o proporcional, versión básica"]
[null,"UR010CK102","heaterSteam 10 kg/h , 230Vac 3~, ON/OFF or proportional, full optional version","heaterSteam 10 kg/h, 230V 3~, ON/OFF o proporzionale, versione full optional","heaterSteam 10 kg/h , 230Vac 3~, ON/OFF or proportional, full optional version","heaterSteam 10 kg/h , 230Vac 3~, ON/OFF ou proportionnel, version toutes options","heaterSteam 10 kg/h , 230Vac 3~, EIN/AUS-Betrieb oder proportional Regelung, Vollversion","heaterSteam 10 kg/h, 230V 3~, todo/nada o proporcional, versión con todas las opciones"]
[null,"UR010CL002","heaterSteam 10 kg/h , 400Vac 3~, ON/OFF or proportional, basic version","heaterSteam 10 kg/h, 400V 3~, ON/OFF o proporzionale, versione base","heaterSteam 10 kg/h , 400Vac 3~, ON/OFF or proportional, basic version","heaterSteam 10 kg/h , 400Vac 3~, ON/OFF ou proportionnel, version de base","heaterSteam 10 kg/h , 400Vac 3~, EIN/AUS-Betrieb oder proportional Regelung, Grundversion","heaterSteam 10 kg/h, 400V 3~, todo/nada o proporcional, versión básica"]
[null,"UR010CL102","heaterSteam 10 kg/h , 400Vac 3~, ON/OFF or proportional, full optional version","heaterSteam 10 kg/h, 400V 3~, ON/OFF o proporzionale, versione full optional","heaterSteam 10 kg/h , 400Vac 3~, ON/OFF or proportional, full optional version","heaterSteam 10 kg/h , 400Vac 3~, ON/OFF ou proportionnel, version toutes options","heaterSteam 10 kg/h , 400Vac 3~, EIN/AUS-Betrieb oder proportional Regelung, Vollversion","heaterSteam 10 kg/h, 400V 3~, todo/nada o proporcional, versión con todas las opciones"]
[null,"UR010CM002","heaterSteam 10 kg/h , 460Vac 3~, ON/OFF or proportional, basic version","heaterSteam 10 kg/h, 460V 3~, ON/OFF o proporzionale, versione base","heaterSteam 10 kg/h , 460Vac 3~, ON/OFF or proportional, basic version","heaterSteam 10 kg/h , 460Vac 3~, ON/OFF ou proportionnel, version de base","heaterSteam 10 kg/h , 460Vac 3~, EIN/AUS-Betrieb oder proportional Regelung, Grundversion","heaterSteam 10 kg/h, 460V 3~, todo/nada o proporcional, versión básica"]
[null,"UR010CM102","heaterSteam 10 kg/h , 460Vac 3~, ON/OFF or proportional, full optional version","heaterSteam 10 kg/h, 460V 3~, ON/OFF o proporzionale, versione full optional","heaterSteam 10 kg/h , 460Vac 3~, ON/OFF or proportional, full optional version","heaterSteam 10 kg/h , 460Vac 3~, ON/OFF ou proportionnel, version toutes options","heaterSteam 10 kg/h , 460Vac 3~, EIN/AUS-Betrieb oder proportional Regelung, Vollversion","heaterSteam 10 kg/h, 460V 3~, todo/nada o proporcional, versión con todas las opciones"]
[null,"UR010CN002","heaterSteam 10 kg/h , 575Vac 3~, ON/OFF or proportional, basic version","heaterSteam 10 kg/h, 575V 3~, ON/OFF o proporzionale, versione base","heaterSteam 10 kg/h , 575Vac 3~, ON/OFF or proportional, basic version","heaterSteam 10 kg/h , 575Vac 3~, ON/OFF ou proportionnel, version de base","heaterSteam 10 kg/h , 575Vac 3~, EIN/AUS-Betrieb oder proportional Regelung, Grundversion","heaterSteam 10 kg/h, 575V 3~, todo/nada o proporcional, versión básica"]
[null,"UR010CN102","heaterSteam 10 kg/h , 575Vac 3~, ON/OFF or proportional, full optional version","heaterSteam 10 kg/h, 575V 3~, ON/OFF o proporzionale, versione full optional","heaterSteam 10 kg/h , 575Vac 3~, ON/OFF or proportional, full optional version","heaterSteam 10 kg/h , 575Vac 3~, ON/OFF ou proportionnel, version toutes options","heaterSteam 10 kg/h , 575Vac 3~, EIN/AUS-Betrieb oder proportional Regelung, Vollversion","heaterSteam 10 kg/h, 575V 3~, todo/nada o proporcional, versión con todas las opciones"]
[null,"UR010CW002","heaterSteam 10 kg/h , 208Vac 3~, ON/OFF or proportional, basic version","heaterSteam 10 kg/h, 208V 3~, ON/OFF o proporzionale, versione base","heaterSteam 10 kg/h , 208Vac 3~, ON/OFF or proportional, basic version","heaterSteam 10 kg/h , 208Vac 3~, ON/OFF ou proportionnel, version de base","heaterSteam 10 kg/h , 208Vac 3~, EIN/AUS-Betrieb oder proportional Regelung, Grundversion","heaterSteam 10 kg/h, 208V 3~, todo/nada o proporcional, versión básica"]
[null,"UR010CW102","heaterSteam 10 kg/h , 208Vac 3~, ON/OFF or proportional, full optional version","heaterSteam 10 kg/h, 208V 3~, ON/OFF o proporzionale, versione full optional","heaterSteam 10 kg/h , 208Vac 3~, ON/OFF or proportional, full optional version","heaterSteam 10 kg/h , 208Vac 3~, ON/OFF ou proportionnel, version toutes options","heaterSteam 10 kg/h , 208Vac 3~, EIN/AUS-Betrieb oder proportional Regelung, Vollversion","heaterSteam 10 kg/h, 208V 3~, todo/nada o proporcional, versión con todas las opciones"]
[null,"UR010HK003","heaterSteam process, 10 kg/h , 230Vac 3~, with regulation","heaterSteam process, 10 kg/h, 230V 3~, regolazione integrata","heaterSteam process, 10 kg/h , 230Vac 3~, with regulation","heaterSteam process, 10 kg/h , 230Vac 3~, avec régulateur","heaterSteam process, 10 kg/h , 230Vac 3~, mit Feuchte-Regelung","heaterSteam process, 10 kg/h, 230V 3~, regulación integrada"]
[null,"UR010HK103","heaterSteam 10 kg/h , 230Vac 3~, with regulation, Titanium version","heaterSteam 10 kg/h, 230V 3~, regolazione integrata, versione Titanium","heaterSteam 10 kg/h , 230Vac 3~, with regulation, Titanium version","heaterSteam 10 kg/h , 230Vac 3~, avec régulateur, version Titanium","heaterSteam 10 kg/h , 230Vac 3~, mit Feuchte-Regelung, Titanium","heaterSteam 10 kg/h, 230V 3~, regulación integrada, versión Titanium"]
[null,"UR010HL003","heaterSteam process, 10 kg/h , 400Vac 3~, with regulation","heaterSteam process, 10 kg/h, 400V 3~, regolazione integrata","heaterSteam process, 10 kg/h , 400Vac 3~, with regulation","heaterSteam process, 10 kg/h , 400Vac 3~, avec régulateur","heaterSteam process, 10 kg/h , 400Vac 3~, mit Feuchte-Regelung","heaterSteam process, 10 kg/h, 400V 3~, regulación integrada"]
[null,"UR010HL103","heaterSteam 10 kg/h , 400Vac 3~, with regulation, Titanium version","heaterSteam 10 kg/h, 400V 3~, regolazione integrata, versione Titanium","heaterSteam 10 kg/h , 400Vac 3~, with regulation, Titanium version","heaterSteam 10 kg/h , 400Vac 3~, avec régulateur, version Titanium","heaterSteam 10 kg/h , 400Vac 3~, mit Feuchte-Regelung, Titanium","heaterSteam 10 kg/h, 400V 3~, regulación integrada, versión Titanium"]
[null,"UR010HM003","heaterSteam process, 10 kg/h , 460Vac 3~, with regulation","heaterSteam process, 10 kg/h, 460V 3~, regolazione integrata","heaterSteam process, 10 kg/h , 460Vac 3~, with regulation","heaterSteam process, 10 kg/h , 460Vac 3~, avec régulateur","heaterSteam process, 10 kg/h , 460Vac 3~, mit Feuchte-Regelung","heaterSteam process, 10 kg/h, 460V 3~, regulación integrada"]
[null,"UR010HM103","heaterSteam 10 kg/h , 460Vac 3~, with regulation, Titanium version","heaterSteam 10 kg/h, 460V 3~, regolazione integrata, versione Titanium","heaterSteam 10 kg/h , 460Vac 3~, with regulation, Titanium version","heaterSteam 10 kg/h , 460Vac 3~, avec régulateur, version Titanium","heaterSteam 10 kg/h , 460Vac 3~, mit Feuchte-Regelung, Titanium","heaterSteam 10 kg/h, 460V 3~, regulación integrada, versión Titanium"]
[null,"UR010HN002","heaterSteam 10 kg/h , 575Vac 3~, with regulation, basic version","heaterSteam 10 kg/h, 575V 3~, regolazione integrata, versione base","heaterSteam 10 kg/h , 575Vac 3~, with regulation, basic version","heaterSteam 10 kg/h , 575Vac 3~, avec régulateur, version de base","heaterSteam 10 kg/h , 575Vac 3~, mit Feuchte-Regelung, Grundversion","heaterSteam 10 kg/h, 575V 3~, regulación integrada, versión básica"]
[null,"UR010HN102","heaterSteam 10 kg/h , 575Vac 3~, with regulation, full optional version","heaterSteam 10 kg/h, 575V 3~, regolazione integrata, versione full optional","heaterSteam 10 kg/h , 575Vac 3~, with regulation, full optional version","heaterSteam 10 kg/h , 575Vac 3~, avec régulateur, version toutes options","heaterSteam 10 kg/h , 575Vac 3~, mit Feuchte-Regelung, Vollversion","heaterSteam 10 kg/h, 575V 3~, regulación integrada, versión con todas las opciones"]
[null,"UR010HW002","heaterSteam 10 kg/h , 208Vac 3~, with regulation, basic version","heaterSteam 10 kg/h, 208V 3~, regolazione integrata, versione base","heaterSteam 10 kg/h , 208Vac 3~, with regulation, basic version","heaterSteam 10 kg/h , 208Vac 3~, avec régulateur, version de base","heaterSteam 10 kg/h , 208Vac 3~, mit Feuchte-Regelung, Grundversion","heaterSteam 10 kg/h, 208V 3~, regulación integrada, versión básica"]
[null,"UR010HW102","heaterSteam 10 kg/h , 208Vac 3~, with regulation, full optional version","heaterSteam 10 kg/h, 208V 3~, regolazione integrata, versione full optional","heaterSteam 10 kg/h , 208Vac 3~, with regulation, full optional version","heaterSteam 10 kg/h , 208Vac 3~, avec régulateur, version toutes options","heaterSteam 10 kg/h , 208Vac 3~, mit Feuchte-Regelung, Vollversion","heaterSteam 10 kg/h, 208V 3~, regulación integrada, versión con todas las opciones"]
[null,"UR013HW002","heaterSteam 13 kg/h , 208Vac 3~, with regulation, basic version","heaterSteam 13 kg/h, 208V 3~, regolazione integrata, versione base","heaterSteam 13 kg/h , 208Vac 3~, with regulation, basic version","heaterSteam 13 kg/h , 208Vac 3~, avec régulateur, version de base","heaterSteam 13 kg/h , 208Vac 3~, mit Feuchte-Regelung, Grundversion","heaterSteam 13 kg/h, 208V 3~, regulación integrada, versión básica"]
[null,"UR013HW102","heaterSteam 13 kg/h , 208Vac 3~, with regulation, full optional version","heaterSteam 13 kg/h, 208V 3~, regolazione integrata, versione full optional","heaterSteam 13 kg/h , 208Vac 3~, with regulation, full optional version","heaterSteam 13 kg/h , 208Vac 3~, avec régulateur, version toutes options","heaterSteam 13 kg/h , 208Vac 3~, mit Feuchte-Regelung, Vollversion","heaterSteam 13 kg/h, 208V 3~, regulación integrada, versión con todas las opciones"]
[null,"UR013HK003","heaterSteam process, 13 kg/h , 230Vac 3~, with regulation","heaterSteam process, 13 kg/h, 230V 3~, regolazione integrata","heaterSteam process, 13 kg/h , 230Vac 3~, with regulation","heaterSteam process, 13 kg/h , 230Vac 3~, avec régulateur","heaterSteam process, 13 kg/h , 230Vac 3~, mit Feuchte-Regelung","heaterSteam process, 13 kg/h, 230V 3~, regulación integrada"]
[null,"UR013HK103","heaterSteam 13 kg/h , 230Vac 3~, with regulation, Titanium version","heaterSteam 13 kg/h, 230V 3~, regolazione integrata, versione Titanium","heaterSteam 13 kg/h , 230Vac 3~, with regulation, Titanium version","heaterSteam 13 kg/h , 230Vac 3~, avec régulateur, version Titanium","heaterSteam 13 kg/h , 230Vac 3~, mit Feuchte-Regelung, Titanium","heaterSteam 13 kg/h, 230V 3~, regulación integrada, versión Titanium"]
[null,"UR013HL003","heaterSteam process, 13 kg/h , 400Vac 3~, with regulation","heaterSteam process, 13 kg/h, 400V 3~, regolazione integrata","heaterSteam process, 13 kg/h , 400Vac 3~, with regulation","heaterSteam process, 13 kg/h , 400Vac 3~, avec régulateur","heaterSteam process, 13 kg/h , 400Vac 3~, mit Feuchte-Regelung","heaterSteam process, 13 kg/h, 400V 3~, regulación integrada"]
[null,"UR013HL103","heaterSteam 13 kg/h , 400Vac 3~, with regulation, Titanium version","heaterSteam 13 kg/h, 400V 3~, regolazione integrata, versione Titanium","heaterSteam 13 kg/h , 400Vac 3~, with regulation, Titanium version","heaterSteam 13 kg/h , 400Vac 3~, avec régulateur, version Titanium","heaterSteam 13 kg/h , 400Vac 3~, mit Feuchte-Regelung, Titanium","heaterSteam 13 kg/h, 400V 3~, regulación integrada, versión Titanium"]
[null,"UR013HM003","heaterSteam process, 13 kg/h , 460Vac 3~, with regulation","heaterSteam process, 13 kg/h, 460V 3~, regolazione integrata","heaterSteam process, 13 kg/h , 460Vac 3~, with regulation","heaterSteam process, 13 kg/h , 460Vac 3~, avec régulateur","heaterSteam process, 13 kg/h , 460Vac 3~, mit Feuchte-Regelung","heaterSteam process, 13 kg/h, 460V 3~, regulación integrada"]
[null,"UR013HM103","heaterSteam 13 kg/h , 460Vac 3~, with regulation, Titanium version","heaterSteam 13 kg/h, 460V 3~, regolazione integrata, versione Titanium","heaterSteam 13 kg/h , 460Vac 3~, with regulation, Titanium version","heaterSteam 13 kg/h , 460Vac 3~, avec régulateur, version Titanium","heaterSteam 13 kg/h , 460Vac 3~, mit Feuchte-Regelung, Titanium","heaterSteam 13 kg/h, 460V 3~, regulación integrada, versión Titanium"]
[null,"UR013HN002","heaterSteam 13 kg/h , 575Vac 3~, with regulation, basic version","heaterSteam 13 kg/h, 575V 3~, regolazione integrata, versione base","heaterSteam 13 kg/h , 575Vac 3~, with regulation, basic version","heaterSteam 13 kg/h , 575Vac 3~, avec régulateur, version de base","heaterSteam 13 kg/h , 575Vac 3~, mit Feuchte-Regelung, Grundversion","heaterSteam 13 kg/h, 575V 3~, regulación integrada, versión básica"]
[null,"UR013HN102","heaterSteam 13 kg/h , 575Vac 3~, with regulation, full optional version","heaterSteam 13 kg/h, 575V 3~, regolazione integrata, versione full optional","heaterSteam 13 kg/h , 575Vac 3~, with regulation, full optional version","heaterSteam 13 kg/h , 575Vac 3~, avec régulateur, version toutes options","heaterSteam 13 kg/h , 575Vac 3~, mit Feuchte-Regelung, Vollversion","heaterSteam 13 kg/h, 575V 3~, regulación integrada, versión con todas las opciones"]
[null,"UR020CK002","heaterSteam 20 kg/h , 230Vac 3~, ON/OFF or proportional, basic version","heaterSteam 20 kg/h, 230V 3~, ON/OFF o proporzionale, versione base","heaterSteam 20 kg/h , 230Vac 3~, ON/OFF or proportional, basic version","heaterSteam 20 kg/h , 230Vac 3~, ON/OFF ou proportionnel, version de base","heaterSteam 20 kg/h , 230Vac 3~, EIN/AUS-Betrieb oder proportional Regelung, Grundversion","heaterSteam 20 kg/h, 230V 3~, todo/nada o proporcional, versión básica"]
[null,"UR020CK102","heaterSteam 20 kg/h , 230Vac 3~, ON/OFF or proportional, full optional version","heaterSteam 20 kg/h, 230V 3~, ON/OFF o proporzionale, versione full optional","heaterSteam 20 kg/h , 230Vac 3~, ON/OFF or proportional, full optional version","heaterSteam 20 kg/h , 230Vac 3~, ON/OFF ou proportionnel, version toutes options","heaterSteam 20 kg/h , 230Vac 3~, EIN/AUS-Betrieb oder proportional Regelung, Vollversion","heaterSteam 20 kg/h, 230V 3~, todo/nada o proporcional, versión con todas las opciones"]
[null,"UR020CL002","heaterSteam 20 kg/h , 400Vac 3~, ON/OFF or proportional, basic version","heaterSteam 20 kg/h, 400V 3~, ON/OFF o proporzionale, versione base","heaterSteam 20 kg/h , 400Vac 3~, ON/OFF or proportional, basic version","heaterSteam 20 kg/h , 400Vac 3~, ON/OFF ou proportionnel, version de base","heaterSteam 20 kg/h , 400Vac 3~, EIN/AUS-Betrieb oder proportional Regelung, Grundversion","heaterSteam 20 kg/h, 400V 3~, todo/nada o proporcional, versión básica"]
[null,"UR020CL102","heaterSteam 20 kg/h , 400Vac 3~, ON/OFF or proportional, full optional version","heaterSteam 20 kg/h, 400V 3~, ON/OFF o proporzionale, versione full optional","heaterSteam 20 kg/h , 400Vac 3~, ON/OFF or proportional, full optional version","heaterSteam 20 kg/h , 400Vac 3~, ON/OFF ou proportionnel, version toutes options","heaterSteam 20 kg/h , 400Vac 3~, EIN/AUS-Betrieb oder proportional Regelung, Vollversion","heaterSteam 20 kg/h, 400V 3~, todo/nada o proporcional, versión con todas las opciones"]
[null,"UR020CM002","heaterSteam 20 kg/h , 460Vac 3~, ON/OFF or proportional, basic version","heaterSteam 20 kg/h, 460V 3~, ON/OFF o proporzionale, versione base","heaterSteam 20 kg/h , 460Vac 3~, ON/OFF or proportional, basic version","heaterSteam 20 kg/h , 460Vac 3~, ON/OFF ou proportionnel, version de base","heaterSteam 20 kg/h , 460Vac 3~, EIN/AUS-Betrieb oder proportional Regelung, Grundversion","heaterSteam 20 kg/h, 460V 3~, todo/nada o proporcional, versión básica"]
[null,"UR020CM102","heaterSteam 20 kg/h , 460Vac 3~, ON/OFF or proportional, full optional version","heaterSteam 20 kg/h, 460V 3~, ON/OFF o proporzionale, versione full optional","heaterSteam 20 kg/h , 460Vac 3~, ON/OFF or proportional, full optional version","heaterSteam 20 kg/h , 460Vac 3~, ON/OFF ou proportionnel, version toutes options","heaterSteam 20 kg/h , 460Vac 3~, EIN/AUS-Betrieb oder proportional Regelung, Vollversion","heaterSteam 20 kg/h, 460V 3~, todo/nada o proporcional, versión con todas las opciones"]
[null,"UR020CN002","heaterSteam 20 kg/h , 575Vac 3~, ON/OFF or proportional, basic version","heaterSteam 20 kg/h, 575V 3~, ON/OFF o proporzionale, versione base","heaterSteam 20 kg/h , 575Vac 3~, ON/OFF or proportional, basic version","heaterSteam 20 kg/h , 575Vac 3~, ON/OFF ou proportionnel, version de base","heaterSteam 20 kg/h , 575Vac 3~, EIN/AUS-Betrieb oder proportional Regelung, Grundversion","heaterSteam 20 kg/h, 575V 3~, todo/nada o proporcional, versión básica"]
[null,"UR020CN102","heaterSteam 20 kg/h , 575Vac 3~, ON/OFF or proportional, full optional version","heaterSteam 20 kg/h, 575V 3~, ON/OFF o proporzionale, versione full optional","heaterSteam 20 kg/h , 575Vac 3~, ON/OFF or proportional, full optional version","heaterSteam 20 kg/h , 575Vac 3~, ON/OFF ou proportionnel, version toutes options","heaterSteam 20 kg/h , 575Vac 3~, EIN/AUS-Betrieb oder proportional Regelung, Vollversion","heaterSteam 20 kg/h, 575V 3~, todo/nada o proporcional, versión con todas las opciones"]
[null,"UR020CW002","heaterSteam 20 kg/h , 208Vac 3~, ON/OFF or proportional, basic version","heaterSteam 20 kg/h, 208V 3~, ON/OFF o proporzionale, versione base","heaterSteam 20 kg/h , 208Vac 3~, ON/OFF or proportional, basic version","heaterSteam 20 kg/h , 208Vac 3~, ON/OFF ou proportionnel, version de base","heaterSteam 20 kg/h , 208Vac 3~, EIN/AUS-Betrieb oder proportional Regelung, Grundversion","heaterSteam 20 kg/h, 208V 3~, todo/nada o proporcional, versión básica"]
[null,"UR020CW102","heaterSteam 20 kg/h , 208Vac 3~, ON/OFF or proportional, full optional version","heaterSteam 20 kg/h, 208V 3~, ON/OFF o proporzionale, versione full optional","heaterSteam 20 kg/h , 208Vac 3~, ON/OFF or proportional, full optional version","heaterSteam 20 kg/h , 208Vac 3~, ON/OFF ou proportionnel, version toutes options","heaterSteam 20 kg/h , 208Vac 3~, EIN/AUS-Betrieb oder proportional Regelung, Vollversion","heaterSteam 20 kg/h, 208V 3~, todo/nada o proporcional, versión con todas las opciones"]
[null,"UR020HK003","heaterSteam process, 20 kg/h , 230Vac 3~, with regulation","heaterSteam process, 20 kg/h, 230V 3~, regolazione integrata","heaterSteam process, 20 kg/h , 230Vac 3~, with regulation","heaterSteam process, 20 kg/h , 230Vac 3~, avec régulateur","heaterSteam process, 20 kg/h , 230Vac 3~, mit Feuchte-Regelung","heaterSteam process, 20 kg/h, 230V 3~, regulación integrada"]
[null,"UR020HK103","heaterSteam 20 kg/h , 230Vac 3~, with regulation, Titanium version","heaterSteam 20 kg/h, 230V 3~, regolazione integrata, versione Titanium","heaterSteam 20 kg/h , 230Vac 3~, with regulation, Titanium version","heaterSteam 20 kg/h , 230Vac 3~, avec régulateur, version Titanium","heaterSteam 20 kg/h , 230Vac 3~, mit Feuchte-Regelung, Titanium","heaterSteam 20 kg/h, 230V 3~, regulación integrada, versión Titanium"]
[null,"UR020HL003","heaterSteam process, 20 kg/h , 400Vac 3~, with regulation","heaterSteam process, 20 kg/h, 400V 3~, regolazione integrata","heaterSteam process, 20 kg/h , 400Vac 3~, with regulation","heaterSteam process, 20 kg/h , 400Vac 3~, avec régulateur","heaterSteam process, 20 kg/h , 400Vac 3~, mit Feuchte-Regelung","heaterSteam process, 20 kg/h, 400V 3~, regulación integrada"]
[null,"UR020HL103","heaterSteam 20 kg/h , 400Vac 3~, with regulation, Titanium version","heaterSteam 20 kg/h, 400V 3~, regolazione integrata, versione Titanium","heaterSteam 20 kg/h , 400Vac 3~, with regulation, Titanium version","heaterSteam 20 kg/h , 400Vac 3~, avec régulateur, version Titanium","heaterSteam 20 kg/h , 400Vac 3~, mit Feuchte-Regelung, Titanium","heaterSteam 20 kg/h, 400V 3~, regulación integrada, versión Titanium"]
[null,"UR020HM003","heaterSteam process, 20 kg/h , 460Vac 3~, with regulation","heaterSteam process, 20 kg/h, 460V 3~, regolazione integrata","heaterSteam process, 20 kg/h , 460Vac 3~, with regulation","heaterSteam process, 20 kg/h , 460Vac 3~, avec régulateur","heaterSteam process, 20 kg/h , 460Vac 3~, mit Feuchte-Regelung","heaterSteam process, 20 kg/h, 460V 3~, regulación integrada"]
[null,"UR020HM103","heaterSteam 20 kg/h , 460Vac 3~, with regulation, Titanium version","heaterSteam 20 kg/h, 460V 3~, regolazione integrata, versione Titanium","heaterSteam 20 kg/h , 460Vac 3~, with regulation, Titanium version","heaterSteam 20 kg/h , 460Vac 3~, avec régulateur, version Titanium","heaterSteam 20 kg/h , 460Vac 3~, mit Feuchte-Regelung, Titanium","heaterSteam 20 kg/h, 460V 3~, regulación integrada, versión Titanium"]
[null,"UR020HN002","heaterSteam 20 kg/h , 575Vac 3~, with regulation, basic version","heaterSteam 20 kg/h, 575V 3~, regolazione integrata, versione base","heaterSteam 20 kg/h , 575Vac 3~, with regulation, basic version","heaterSteam 20 kg/h , 575Vac 3~, avec régulateur, version de base","heaterSteam 20 kg/h , 575Vac 3~, mit Feuchte-Regelung, Grundversion","heaterSteam 20 kg/h, 575V 3~, regulación integrada, versión básica"]
[null,"UR020HN102","heaterSteam 20 kg/h , 575Vac 3~, with regulation, full optional version","heaterSteam 20 kg/h, 575V 3~, regolazione integrata, versione full optional","heaterSteam 20 kg/h , 575Vac 3~, with regulation, full optional version","heaterSteam 20 kg/h , 575Vac 3~, avec régulateur, version toutes options","heaterSteam 20 kg/h , 575Vac 3~, mit Feuchte-Regelung, Vollversion","heaterSteam 20 kg/h, 575V 3~, regulación integrada, versión con todas las opciones"]
[null,"UR020HW002","heaterSteam 20 kg/h , 208Vac 3~, with regulation, basic version","heaterSteam 20 kg/h, 208V 3~, regolazione integrata, versione base","heaterSteam 20 kg/h , 208Vac 3~, with regulation, basic version","heaterSteam 20 kg/h , 208Vac 3~, avec régulateur, version de base","heaterSteam 20 kg/h , 208Vac 3~, mit Feuchte-Regelung, Grundversion","heaterSteam 20 kg/h, 208V 3~, regulación integrada, versión básica"]
[null,"UR020HW102","heaterSteam 20 kg/h , 208Vac 3~, with regulation, full optional version","heaterSteam 20 kg/h, 208V 3~, regolazione integrata, versione full optional","heaterSteam 20 kg/h , 208Vac 3~, with regulation, full optional version","heaterSteam 20 kg/h , 208Vac 3~, avec régulateur, version toutes options","heaterSteam 20 kg/h , 208Vac 3~, mit Feuchte-Regelung, Vollversion","heaterSteam 20 kg/h, 208V 3~, regulación integrada, versión con todas las opciones"]
[null,"UR027CK002","heaterSteam 27 kg/h , 230Vac 3~, ON/OFF or proportional, basic version","heaterSteam 27 kg/h, 230V 3~, ON/OFF o proporzionale, versione base","heaterSteam 27 kg/h , 230Vac 3~, ON/OFF or proportional, basic version","heaterSteam 27 kg/h , 230Vac 3~, ON/OFF ou proportionnel, version de base","heaterSteam 27 kg/h , 230Vac 3~, EIN/AUS-Betrieb oder proportional Regelung, Grundversion","heaterSteam 27 kg/h, 230V 3~, todo/nada o proporcional, versión básica"]
[null,"UR027CK102","heaterSteam 27 kg/h , 230Vac 3~, ON/OFF or proportional, full optional version","heaterSteam 27 kg/h, 230V 3~, ON/OFF o proporzionale, versione full optional","heaterSteam 27 kg/h , 230Vac 3~, ON/OFF or proportional, full optional version","heaterSteam 27 kg/h , 230Vac 3~, ON/OFF ou proportionnel, version toutes options","heaterSteam 27 kg/h , 230Vac 3~, EIN/AUS-Betrieb oder proportional Regelung, Vollversion","heaterSteam 27 kg/h, 230V 3~, todo/nada o proporcional, versión con todas las opciones"]
[null,"UR027CL002","heaterSteam 27 kg/h , 400Vac 3~, ON/OFF or proportional, basic version","heaterSteam 27 kg/h, 400V 3~, ON/OFF o proporzionale, versione base","heaterSteam 27 kg/h , 400Vac 3~, ON/OFF or proportional, basic version","heaterSteam 27 kg/h , 400Vac 3~, ON/OFF ou proportionnel, version de base","heaterSteam 27 kg/h , 400Vac 3~, EIN/AUS-Betrieb oder proportional Regelung, Grundversion","heaterSteam 27 kg/h, 400V 3~, todo/nada o proporcional, versión básica"]
[null,"UR027CL102","heaterSteam 27 kg/h , 400Vac 3~, ON/OFF or proportional, full optional version","heaterSteam 27 kg/h, 400V 3~, ON/OFF o proporzionale, versione full optional","heaterSteam 27 kg/h , 400Vac 3~, ON/OFF or proportional, full optional version","heaterSteam 27 kg/h , 400Vac 3~, ON/OFF ou proportionnel, version toutes options","heaterSteam 27 kg/h , 400Vac 3~, EIN/AUS-Betrieb oder proportional Regelung, Vollversion","heaterSteam 27 kg/h, 400V 3~, todo/nada o proporcional, versión con todas las opciones"]
[null,"UR027CM002","heaterSteam 27 kg/h , 460Vac 3~, ON/OFF or proportional, basic version","heaterSteam 27 kg/h, 460V 3~, ON/OFF o proporzionale, versione base","heaterSteam 27 kg/h , 460Vac 3~, ON/OFF or proportional, basic version","heaterSteam 27 kg/h , 460Vac 3~, ON/OFF ou proportionnel, version de base","heaterSteam 27 kg/h , 460Vac 3~, EIN/AUS-Betrieb oder proportional Regelung, Grundversion","heaterSteam 27 kg/h, 460V 3~, todo/nada o proporcional, versión básica"]
[null,"UR027CM102","heaterSteam 27 kg/h , 460Vac 3~, ON/OFF or proportional, full optional version","heaterSteam 27 kg/h, 460V 3~, ON/OFF o proporzionale, versione full optional","heaterSteam 27 kg/h , 460Vac 3~, ON/OFF or proportional, full optional version","heaterSteam 27 kg/h , 460Vac 3~, ON/OFF ou proportionnel, version toutes options","heaterSteam 27 kg/h , 460Vac 3~, EIN/AUS-Betrieb oder proportional Regelung, Vollversion","heaterSteam 27 kg/h, 460V 3~, todo/nada o proporcional, versión con todas las opciones"]
[null,"UR027CN002","heaterSteam 27 kg/h , 575Vac 3~, ON/OFF or proportional, basic version","heaterSteam 27 kg/h, 575V 3~, ON/OFF o proporzionale, versione base","heaterSteam 27 kg/h , 575Vac 3~, ON/OFF or proportional, basic version","heaterSteam 27 kg/h , 575Vac 3~, ON/OFF ou proportionnel, version de base","heaterSteam 27 kg/h , 575Vac 3~, EIN/AUS-Betrieb oder proportional Regelung, Grundversion","heaterSteam 27 kg/h, 575V 3~, todo/nada o proporcional, versión básica"]
[null,"UR027CN102","heaterSteam 27 kg/h , 575Vac 3~, ON/OFF or proportional, full optional version","heaterSteam 27 kg/h, 575V 3~, ON/OFF o proporzionale, versione full optional","heaterSteam 27 kg/h , 575Vac 3~, ON/OFF or proportional, full optional version","heaterSteam 27 kg/h , 575Vac 3~, ON/OFF ou proportionnel, version toutes options","heaterSteam 27 kg/h , 575Vac 3~, EIN/AUS-Betrieb oder proportional Regelung, Vollversion","heaterSteam 27 kg/h, 575V 3~, todo/nada o proporcional, versión con todas las opciones"]
[null,"UR027CW002","heaterSteam 27 kg/h , 208Vac 3~, ON/OFF or proportional, basic version","heaterSteam 27 kg/h, 208V 3~, ON/OFF o proporzionale, versione base","heaterSteam 27 kg/h , 208Vac 3~, ON/OFF or proportional, basic version","heaterSteam 27 kg/h , 208Vac 3~, ON/OFF ou proportionnel, version de base","heaterSteam 27 kg/h , 208Vac 3~, EIN/AUS-Betrieb oder proportional Regelung, Grundversion","heaterSteam 27 kg/h, 208V 3~, todo/nada o proporcional, versión básica"]
[null,"UR027CW102","heaterSteam 27 kg/h , 208Vac 3~, ON/OFF or proportional, full optional version","heaterSteam 27 kg/h, 208V 3~, ON/OFF o proporzionale, versione full optional","heaterSteam 27 kg/h , 208Vac 3~, ON/OFF or proportional, full optional version","heaterSteam 27 kg/h , 208Vac 3~, ON/OFF ou proportionnel, version toutes options","heaterSteam 27 kg/h , 208Vac 3~, EIN/AUS-Betrieb oder proportional Regelung, Vollversion","heaterSteam 27 kg/h, 208V 3~, todo/nada o proporcional, versión con todas las opciones"]
[null,"UR027HK003","heaterSteam process, 27 kg/h , 230Vac 3~, with regulation","heaterSteam process, 27 kg/h, 230V 3~, regolazione integrata","heaterSteam process, 27 kg/h , 230Vac 3~, with regulation","heaterSteam process, 27 kg/h , 230Vac 3~, avec régulateur","heaterSteam process, 27 kg/h , 230Vac 3~, mit Feuchte-Regelung","heaterSteam process, 27 kg/h, 230V 3~, regulación integrada"]
[null,"UR027HK103","heaterSteam 27 kg/h , 230Vac 3~, with regulation, Titanium version","heaterSteam 27 kg/h, 230V 3~, regolazione integrata, versione Titanium","heaterSteam 27 kg/h , 230Vac 3~, with regulation, Titanium version","heaterSteam 27 kg/h , 230Vac 3~, avec régulateur, version Titanium","heaterSteam 27 kg/h , 230Vac 3~, mit Feuchte-Regelung, Titanium","heaterSteam 27 kg/h, 230V 3~, regulación integrada, versión Titanium"]
[null,"UR027HL003","heaterSteam process, 27 kg/h , 400Vac 3~, with regulation","heaterSteam process, 27 kg/h, 400V 3~, regolazione integrata","heaterSteam process, 27 kg/h , 400Vac 3~, with regulation","heaterSteam process, 27 kg/h , 400Vac 3~, avec régulateur","heaterSteam process, 27 kg/h , 400Vac 3~, mit Feuchte-Regelung","heaterSteam process, 27 kg/h, 400V 3~, regulación integrada"]
[null,"UR027HL103","heaterSteam 27 kg/h , 400Vac 3~, with regulation, Titanium version","heaterSteam 27 kg/h, 400V 3~, regolazione integrata, versione Titanium","heaterSteam 27 kg/h , 400Vac 3~, with regulation, Titanium version","heaterSteam 27 kg/h , 400Vac 3~, avec régulateur, version Titanium","heaterSteam 27 kg/h , 400Vac 3~, mit Feuchte-Regelung, Titanium","heaterSteam 27 kg/h, 400V 3~, regulación integrada, versión Titanium"]
[null,"UR027HM003","heaterSteam process, 27 kg/h , 460Vac 3~, with regulation","heaterSteam process, 27 kg/h, 460V 3~, regolazione integrata","heaterSteam process, 27 kg/h , 460Vac 3~, with regulation","heaterSteam process, 27 kg/h , 460Vac 3~, avec régulateur","heaterSteam process, 27 kg/h , 460Vac 3~, mit Feuchte-Regelung","heaterSteam process, 27 kg/h, 460V 3~, regulación integrada"]
[null,"UR027HM103","heaterSteam 27 kg/h , 460Vac 3~, with regulation, Titanium version","heaterSteam 27 kg/h, 460V 3~, regolazione integrata, versione Titanium","heaterSteam 27 kg/h , 460Vac 3~, with regulation, Titanium version","heaterSteam 27 kg/h , 460Vac 3~, avec régulateur, version Titanium","heaterSteam 27 kg/h , 460Vac 3~, mit Feuchte-Regelung, Titanium","heaterSteam 27 kg/h, 460V 3~, regulación integrada, versión Titanium"]
[null,"UR027HN002","heaterSteam 27 kg/h , 575Vac 3~, with regulation, basic version","heaterSteam 27 kg/h, 575V 3~, regolazione integrata, versione base","heaterSteam 27 kg/h , 575Vac 3~, with regulation, basic version","heaterSteam 27 kg/h , 575Vac 3~, avec régulateur, version de base","heaterSteam 27 kg/h , 575Vac 3~, mit Feuchte-Regelung, Grundversion","heaterSteam 27 kg/h, 575V 3~, regulación integrada, versión básica"]
[null,"UR027HN102","heaterSteam 27 kg/h , 575Vac 3~, with regulation, full optional version","heaterSteam 27 kg/h, 575V 3~, regolazione integrata, versione full optional","heaterSteam 27 kg/h , 575Vac 3~, with regulation, full optional version","heaterSteam 27 kg/h , 575Vac 3~, avec régulateur, version toutes options","heaterSteam 27 kg/h , 575Vac 3~, mit Feuchte-Regelung, Vollversion","heaterSteam 27 kg/h, 575V 3~, regulación integrada, versión con todas las opciones"]
[null,"UR027HW002","heaterSteam 27 kg/h , 208Vac 3~, with regulation, basic version","heaterSteam 27 kg/h, 208V 3~, regolazione integrata, versione base","heaterSteam 27 kg/h , 208Vac 3~, with regulation, basic version","heaterSteam 27 kg/h , 208Vac 3~, avec régulateur, version de base","heaterSteam 27 kg/h , 208Vac 3~, mit Feuchte-Regelung, Grundversion","heaterSteam 27 kg/h, 208V 3~, regulación integrada, versión básica"]
[null,"UR027HW102","heaterSteam 27 kg/h , 208Vac 3~, with regulation, full optional version","heaterSteam 27 kg/h, 208V 3~, regolazione integrata, versione full optional","heaterSteam 27 kg/h , 208Vac 3~, with regulation, full optional version","heaterSteam 27 kg/h , 208Vac 3~, avec régulateur, version toutes options","heaterSteam 27 kg/h , 208Vac 3~, mit Feuchte-Regelung, Vollversion","heaterSteam 27 kg/h, 208V 3~, regulación integrada, versión con todas las opciones"]
[null,"UR040CK002","heaterSteam 40 kg/h , 230Vac 3~, ON/OFF or proportional, basic version","heaterSteam 40 kg/h, 230V 3~, ON/OFF o proporzionale, versione base","heaterSteam 40 kg/h , 230Vac 3~, ON/OFF or proportional, basic version","heaterSteam 40 kg/h , 230Vac 3~, ON/OFF ou proportionnel, version de base","heaterSteam 40 kg/h , 230Vac 3~, EIN/AUS-Betrieb oder proportional Regelung, Grundversion","heaterSteam 40 kg/h, 230V 3~, todo/nada o proporcional, versión básica"]
[null,"UR040CK102","heaterSteam 40 kg/h , 230Vac 3~, ON/OFF or proportional, full optional version","heaterSteam 40 kg/h, 230V 3~, ON/OFF o proporzionale, versione full optional","heaterSteam 40 kg/h , 230Vac 3~, ON/OFF or proportional, full optional version","heaterSteam 40 kg/h , 230Vac 3~, ON/OFF ou proportionnel, version toutes options","heaterSteam 40 kg/h , 230Vac 3~, EIN/AUS-Betrieb oder proportional Regelung, Vollversion","heaterSteam 40 kg/h, 230V 3~, todo/nada o proporcional, versión con todas las opciones"]
[null,"UR040CL002","heaterSteam 40 kg/h , 400Vac 3~, ON/OFF or proportional, basic version","heaterSteam 40 kg/h, 400V 3~, ON/OFF o proporzionale, versione base","heaterSteam 40 kg/h , 400Vac 3~, ON/OFF or proportional, basic version","heaterSteam 40 kg/h , 400Vac 3~, ON/OFF ou proportionnel, version de base","heaterSteam 40 kg/h , 400Vac 3~, EIN/AUS-Betrieb oder proportional Regelung, Grundversion","heaterSteam 40 kg/h, 400V 3~, todo/nada o proporcional, versión básica"]
[null,"UR040CL102","heaterSteam 40 kg/h , 400Vac 3~, ON/OFF or proportional, full optional version","heaterSteam 40 kg/h, 400V 3~, ON/OFF o proporzionale, versione full optional","heaterSteam 40 kg/h , 400Vac 3~, ON/OFF or proportional, full optional version","heaterSteam 40 kg/h , 400Vac 3~, ON/OFF ou proportionnel, version toutes options","heaterSteam 40 kg/h , 400Vac 3~, EIN/AUS-Betrieb oder proportional Regelung, Vollversion","heaterSteam 40 kg/h, 400V 3~, todo/nada o proporcional, versión con todas las opciones"]
[null,"UR040CM002","heaterSteam 40 kg/h , 460Vac 3~, ON/OFF or proportional, basic version","heaterSteam 40 kg/h, 460V 3~, ON/OFF o proporzionale, versione base","heaterSteam 40 kg/h , 460Vac 3~, ON/OFF or proportional, basic version","heaterSteam 40 kg/h , 460Vac 3~, ON/OFF ou proportionnel, version de base","heaterSteam 40 kg/h , 460Vac 3~, EIN/AUS-Betrieb oder proportional Regelung, Grundversion","heaterSteam 40 kg/h, 460V 3~, todo/nada o proporcional, versión básica"]
[null,"UR040CM102","heaterSteam 40 kg/h , 460Vac 3~, ON/OFF or proportional, full optional version","heaterSteam 40 kg/h, 460V 3~, ON/OFF o proporzionale, versione full optional","heaterSteam 40 kg/h , 460Vac 3~, ON/OFF or proportional, full optional version","heaterSteam 40 kg/h , 460Vac 3~, ON/OFF ou proportionnel, version toutes options","heaterSteam 40 kg/h , 460Vac 3~, EIN/AUS-Betrieb oder proportional Regelung, Vollversion","heaterSteam 40 kg/h, 460V 3~, todo/nada o proporcional, versión con todas las opciones"]
[null,"UR040CN002","heaterSteam 40 kg/h , 575Vac 3~, ON/OFF or proportional, basic version","heaterSteam 40 kg/h, 575V 3~, ON/OFF o proporzionale, versione base","heaterSteam 40 kg/h , 575Vac 3~, ON/OFF or proportional, basic version","heaterSteam 40 kg/h , 575Vac 3~, ON/OFF ou proportionnel, version de base","heaterSteam 40 kg/h , 575Vac 3~, EIN/AUS-Betrieb oder proportional Regelung, Grundversion","heaterSteam 40 kg/h, 575V 3~, todo/nada o proporcional, versión básica"]
[null,"UR040CN102","heaterSteam 40 kg/h , 575Vac 3~, ON/OFF or proportional, full optional version","heaterSteam 40 kg/h, 575V 3~, ON/OFF o proporzionale, versione full optional","heaterSteam 40 kg/h , 575Vac 3~, ON/OFF or proportional, full optional version","heaterSteam 40 kg/h , 575Vac 3~, ON/OFF ou proportionnel, version toutes options","heaterSteam 40 kg/h , 575Vac 3~, EIN/AUS-Betrieb oder proportional Regelung, Vollversion","heaterSteam 40 kg/h, 575V 3~, todo/nada o proporcional, versión con todas las opciones"]
[null,"UR040CW002","heaterSteam 40 kg/h , 208Vac 3~, ON/OFF or proportional, basic version","heaterSteam 40 kg/h, 208V 3~, ON/OFF o proporzionale, versione base","heaterSteam 40 kg/h , 208Vac 3~, ON/OFF or proportional, basic version","heaterSteam 40 kg/h , 208Vac 3~, ON/OFF ou proportionnel, version de base","heaterSteam 40 kg/h , 208Vac 3~, EIN/AUS-Betrieb oder proportional Regelung, Grundversion","heaterSteam 40 kg/h, 208V 3~, todo/nada o proporcional, versión básica"]
[null,"UR040CW102","heaterSteam 40 kg/h , 208Vac 3~, ON/OFF or proportional, full optional version","heaterSteam 40 kg/h, 208V 3~, ON/OFF o proporzionale, versione full optional","heaterSteam 40 kg/h , 208Vac 3~, ON/OFF or proportional, full optional version","heaterSteam 40 kg/h , 208Vac 3~, ON/OFF ou proportionnel, version toutes options","heaterSteam 40 kg/h , 208Vac 3~, EIN/AUS-Betrieb oder proportional Regelung, Vollversion","heaterSteam 40 kg/h, 208V 3~, todo/nada o proporcional, versión con todas las opciones"]
[null,"UR040HK002","heaterSteam 40 kg/h , 230Vac 3~, with regulation, basic version","heaterSteam 40 kg/h, 230V 3~, regolazione integrata, versione base","heaterSteam 40 kg/h , 230Vac 3~, with regulation, basic version","heaterSteam 40 kg/h , 230Vac 3~, avec régulateur, version de base","heaterSteam 40 kg/h , 230Vac 3~, mit Feuchte-Regelung, Grundversion","heaterSteam 40 kg/h, 230V 3~, regulación integrada, versión básica"]
[null,"UR040HK102","heaterSteam 40 kg/h , 230Vac 3~, with regulation, full optional version","heaterSteam 40 kg/h, 230V 3~, regolazione integrata, versione full optional","heaterSteam 40 kg/h , 230Vac 3~, with regulation, full optional version","heaterSteam 40 kg/h , 230Vac 3~, avec régulateur, version toutes options","heaterSteam 40 kg/h , 230Vac 3~, mit Feuchte-Regelung, Vollversion","heaterSteam 40 kg/h, 230V 3~, regulación integrada, versión con todas las opciones"]
[null,"UR040HL003","heaterSteam process, 40 kg/h , 400Vac 3~, with regulation","heaterSteam process, 40 kg/h, 400V 3~, regolazione integrata","heaterSteam process, 40 kg/h , 400Vac 3~, with regulation","heaterSteam process, 40 kg/h , 400Vac 3~, avec régulateur","heaterSteam process, 40 kg/h , 400Vac 3~, mit Feuchte-Regelung","heaterSteam process, 40 kg/h, 400V 3~, regulación integrada"]
[null,"UR040HL103","heaterSteam 40 kg/h , 400Vac 3~, with regulation, Titanium version","heaterSteam 40 kg/h, 400V 3~, regolazione integrata, versione Titanium","heaterSteam 40 kg/h , 400Vac 3~, with regulation, Titanium version","heaterSteam 40 kg/h , 400Vac 3~, avec régulateur, version Titanium","heaterSteam 40 kg/h , 400Vac 3~, mit Feuchte-Regelung, Titanium","heaterSteam 40 kg/h, 400V 3~, regulación integrada, versión Titanium"]
[null,"UR040HM003","heaterSteam process, 40 kg/h , 460Vac 3~, with regulation","heaterSteam process, 40 kg/h, 460V 3~, regolazione integrata","heaterSteam process, 40 kg/h , 460Vac 3~, with regulation","heaterSteam process, 40 kg/h , 460Vac 3~, avec régulateur","heaterSteam process, 40 kg/h , 460Vac 3~, mit Feuchte-Regelung","heaterSteam process, 40 kg/h, 460V 3~, regulación integrada"]
[null,"UR040HM103","heaterSteam 40 kg/h , 460Vac 3~, with regulation, Titanium version","heaterSteam 40 kg/h, 460V 3~, regolazione integrata, versione Titanium","heaterSteam 40 kg/h , 460Vac 3~, with regulation, Titanium version","heaterSteam 40 kg/h , 460Vac 3~, avec régulateur, version Titanium","heaterSteam 40 kg/h , 460Vac 3~, mit Feuchte-Regelung, Titanium","heaterSteam 40 kg/h, 460V 3~, regulación integrada, versión Titanium"]
[null,"UR040HN002","heaterSteam 40 kg/h , 575Vac 3~, with regulation, basic version","heaterSteam 40 kg/h, 575V 3~, regolazione integrata, versione base","heaterSteam 40 kg/h , 575Vac 3~, with regulation, basic version","heaterSteam 40 kg/h , 575Vac 3~, avec régulateur, version de base","heaterSteam 40 kg/h , 575Vac 3~, mit Feuchte-Regelung, Grundversion","heaterSteam 40 kg/h, 575V 3~, regulación integrada, versión básica"]
[null,"UR040HN102","heaterSteam 40 kg/h , 575Vac 3~, with regulation, full optional version","heaterSteam 40 kg/h, 575V 3~, regolazione integrata, versione full optional","heaterSteam 40 kg/h , 575Vac 3~, with regulation, full optional version","heaterSteam 40 kg/h , 575Vac 3~, avec régulateur, version toutes options","heaterSteam 40 kg/h , 575Vac 3~, mit Feuchte-Regelung, Vollversion","heaterSteam 40 kg/h, 575V 3~, regulación integrada, versión con todas las opciones"]
[null,"UR040HW002","heaterSteam 40 kg/h , 208Vac 3~, with regulation, basic version","heaterSteam 40 kg/h, 208V 3~, regolazione integrata, versione base","heaterSteam 40 kg/h , 208Vac 3~, with regulation, basic version","heaterSteam 40 kg/h , 208Vac 3~, avec régulateur, version de base","heaterSteam 40 kg/h , 208Vac 3~, mit Feuchte-Regelung, Grundversion","heaterSteam 40 kg/h, 208V 3~, regulación integrada, versión básica"]
[null,"UR040HW102","heaterSteam 40 kg/h , 208Vac 3~, with regulation, full optional version","heaterSteam 40 kg/h, 208V 3~, regolazione integrata, versione full optional","heaterSteam 40 kg/h , 208Vac 3~, with regulation, full optional version","heaterSteam 40 kg/h , 208Vac 3~, avec régulateur, version toutes options","heaterSteam 40 kg/h , 208Vac 3~, mit Feuchte-Regelung, Vollversion","heaterSteam 40 kg/h, 208V 3~, regulación integrada, versión con todas las opciones"]
[null,"UR053HL003","heaterSteam process, 53 kg/h , 400Vac 3~, with regulation","heaterSteam process, 53 kg/h, 400V 3~, regolazione integrata","heaterSteam process, 53 kg/h , 400Vac 3~, with regulation","heaterSteam process, 53 kg/h , 400Vac 3~, avec régulateur","heaterSteam process, 53 kg/h , 400Vac 3~, mit Feuchte-Regelung","heaterSteam process, 53 kg/h, 400V 3~, regulación integrada"]
[null,"UR053HL103","heaterSteam 53 kg/h , 400Vac 3~, with regulation, Titanium version","heaterSteam 53 kg/h, 400V 3~, regolazione integrata, versione Titanium","heaterSteam 53 kg/h , 400Vac 3~, with regulation, Titanium version","heaterSteam 53 kg/h , 400Vac 3~, avec régulateur, version Titanium","heaterSteam 53 kg/h , 400Vac 3~, mit Feuchte-Regelung, Titanium","heaterSteam 53 kg/h, 400V 3~, regulación integrada, versión Titanium"]
[null,"UR053HM003","heaterSteam process, 53 kg/h , 460Vac 3~, with regulation","heaterSteam process, 53 kg/h, 460V 3~, regolazione integrata","heaterSteam process, 53 kg/h , 460Vac 3~, with regulation","heaterSteam process, 53 kg/h , 460Vac 3~, avec régulateur","heaterSteam process, 53 kg/h , 460Vac 3~, mit Feuchte-Regelung","heaterSteam process, 53 kg/h, 460V 3~, regulación integrada"]
[null,"UR053HM103","heaterSteam 53 kg/h , 460Vac 3~, with regulation, Titanium version","heaterSteam 53 kg/h, 460V 3~, regolazione integrata, versione Titanium","heaterSteam 53 kg/h , 460Vac 3~, with regulation, Titanium version","heaterSteam 53 kg/h , 460Vac 3~, avec régulateur, version Titanium","heaterSteam 53 kg/h , 460Vac 3~, mit Feuchte-Regelung, Titanium","heaterSteam 53 kg/h, 460V 3~, regulación integrada, versión Titanium"]
[null,"UR053HN002","heaterSteam 53 kg/h , 575Vac 3~, with regulation, basic version","heaterSteam 53 kg/h, 575V 3~, regolazione integrata, versione base","heaterSteam 53 kg/h , 575Vac 3~, with regulation, basic version","heaterSteam 53 kg/h , 575Vac 3~, avec régulateur, version de base","heaterSteam 53 kg/h , 575Vac 3~, mit Feuchte-Regelung, Grundversion","heaterSteam 53 kg/h, 575V 3~, regulación integrada, versión básica"]
[null,"UR053HN102","heaterSteam 53 kg/h , 575Vac 3~, with regulation, full optional version","heaterSteam 53 kg/h, 575V 3~, regolazione integrata, versione full optional","heaterSteam 53 kg/h , 575Vac 3~, with regulation, full optional version","heaterSteam 53 kg/h , 575Vac 3~, avec régulateur, version toutes options","heaterSteam 53 kg/h , 575Vac 3~, mit Feuchte-Regelung, Vollversion","heaterSteam 53 kg/h, 575V 3~, regulación integrada, versión con todas las opciones"]
[null,"UR060CK002","heaterSteam 60 kg/h , 230Vac 3~, ON/OFF or proportional, basic version","heaterSteam 60 kg/h, 230V 3~, ON/OFF o proporzionale, versione base","heaterSteam 60 kg/h , 230Vac 3~, ON/OFF or proportional, basic version","heaterSteam 60 kg/h , 230Vac 3~, ON/OFF ou proportionnel, version de base","heaterSteam 60 kg/h , 230Vac 3~, EIN/AUS-Betrieb oder proportional Regelung, Grundversion","heaterSteam 60 kg/h, 230V 3~, todo/nada o proporcional, versión básica"]
[null,"UR060CK102","heaterSteam 60 kg/h , 230Vac 3~, ON/OFF or proportional, full optional version","heaterSteam 60 kg/h, 230V 3~, ON/OFF o proporzionale, versione full optional","heaterSteam 60 kg/h , 230Vac 3~, ON/OFF or proportional, full optional version","heaterSteam 60 kg/h , 230Vac 3~, ON/OFF ou proportionnel, version toutes options","heaterSteam 60 kg/h , 230Vac 3~, EIN/AUS-Betrieb oder proportional Regelung, Vollversion","heaterSteam 60 kg/h, 230V 3~, todo/nada o proporcional, versión con todas las opciones"]
[null,"UR060CL002","heaterSteam 60 kg/h , 400Vac 3~, ON/OFF or proportional, basic version","heaterSteam 60 kg/h, 400V 3~, ON/OFF o proporzionale, versione base","heaterSteam 60 kg/h , 400Vac 3~, ON/OFF or proportional, basic version","heaterSteam 60 kg/h , 400Vac 3~, ON/OFF ou proportionnel, version de base","heaterSteam 60 kg/h , 400Vac 3~, EIN/AUS-Betrieb oder proportional Regelung, Grundversion","heaterSteam 60 kg/h, 400V 3~, todo/nada o proporcional, versión básica"]
[null,"UR060CL102","heaterSteam 60 kg/h , 400Vac 3~, ON/OFF or proportional, full optional version","heaterSteam 60 kg/h, 400V 3~, ON/OFF o proporzionale, versione full optional","heaterSteam 60 kg/h , 400Vac 3~, ON/OFF or proportional, full optional version","heaterSteam 60 kg/h , 400Vac 3~, ON/OFF ou proportionnel, version toutes options","heaterSteam 60 kg/h , 400Vac 3~, EIN/AUS-Betrieb oder proportional Regelung, Vollversion","heaterSteam 60 kg/h, 400V 3~, todo/nada o proporcional, versión con todas las opciones"]
[null,"UR060CM002","heaterSteam 60 kg/h , 460Vac 3~, ON/OFF or proportional, basic version","heaterSteam 60 kg/h, 460V 3~, ON/OFF o proporzionale, versione base","heaterSteam 60 kg/h , 460Vac 3~, ON/OFF or proportional, basic version","heaterSteam 60 kg/h , 460Vac 3~, ON/OFF ou proportionnel, version de base","heaterSteam 60 kg/h , 460Vac 3~, EIN/AUS-Betrieb oder proportional Regelung, Grundversion","heaterSteam 60 kg/h, 460V 3~, todo/nada o proporcional, versión básica"]
[null,"UR060CM102","heaterSteam 60 kg/h , 460Vac 3~, ON/OFF or proportional, full optional version","heaterSteam 60 kg/h, 460V 3~, ON/OFF o proporzionale, versione full optional","heaterSteam 60 kg/h , 460Vac 3~, ON/OFF or proportional, full optional version","heaterSteam 60 kg/h , 460Vac 3~, ON/OFF ou proportionnel, version toutes options","heaterSteam 60 kg/h , 460Vac 3~, EIN/AUS-Betrieb oder proportional Regelung, Vollversion","heaterSteam 60 kg/h, 460V 3~, todo/nada o proporcional, versión con todas las opciones"]
[null,"UR060CN002","heaterSteam 60 kg/h , 575Vac 3~, ON/OFF or proportional, basic version","heaterSteam 60 kg/h, 575V 3~, ON/OFF o proporzionale, versione base","heaterSteam 60 kg/h , 575Vac 3~, ON/OFF or proportional, basic version","heaterSteam 60 kg/h , 575Vac 3~, ON/OFF ou proportionnel, version de base","heaterSteam 60 kg/h , 575Vac 3~, EIN/AUS-Betrieb oder proportional Regelung, Grundversion","heaterSteam 60 kg/h, 575V 3~, todo/nada o proporcional, versión básica"]
[null,"UR060CN102","heaterSteam 60 kg/h , 575Vac 3~, ON/OFF or proportional, full optional version","heaterSteam 60 kg/h, 575V 3~, ON/OFF o proporzionale, versione full optional","heaterSteam 60 kg/h , 575Vac 3~, ON/OFF or proportional, full optional version","heaterSteam 60 kg/h , 575Vac 3~, ON/OFF ou proportionnel, version toutes options","heaterSteam 60 kg/h , 575Vac 3~, EIN/AUS-Betrieb oder proportional Regelung, Vollversion","heaterSteam 60 kg/h, 575V 3~, todo/nada o proporcional, versión con todas las opciones"]
[null,"UR060CW002","heaterSteam 60 kg/h , 208Vac 3~, ON/OFF or proportional, basic version","heaterSteam 60 kg/h, 208V 3~, ON/OFF o proporzionale, versione base","heaterSteam 60 kg/h , 208Vac 3~, ON/OFF or proportional, basic version","heaterSteam 60 kg/h , 208Vac 3~, ON/OFF ou proportionnel, version de base","heaterSteam 60 kg/h , 208Vac 3~, EIN/AUS-Betrieb oder proportional Regelung, Grundversion","heaterSteam 60 kg/h, 208V 3~, todo/nada o proporcional, versión básica"]
[null,"UR060CW102","heaterSteam 60 kg/h , 208Vac 3~, ON/OFF or proportional, full optional version","heaterSteam 60 kg/h, 208V 3~, ON/OFF o proporzionale, versione full optional","heaterSteam 60 kg/h , 208Vac 3~, ON/OFF or proportional, full optional version","heaterSteam 60 kg/h , 208Vac 3~, ON/OFF ou proportionnel, version toutes options","heaterSteam 60 kg/h , 208Vac 3~, EIN/AUS-Betrieb oder proportional Regelung, Vollversion","heaterSteam 60 kg/h, 208V 3~, todo/nada o proporcional, versión con todas las opciones"]
[null,"UR060HK002","heaterSteam 60 kg/h , 230Vac 3~, with regulation, basic version","heaterSteam 60 kg/h, 230V 3~, regolazione integrata, versione base","heaterSteam 60 kg/h , 230Vac 3~, with regulation, basic version","heaterSteam 60 kg/h , 230Vac 3~, avec régulateur, version de base","heaterSteam 60 kg/h , 230Vac 3~, mit Feuchte-Regelung, Grundversion","heaterSteam 60 kg/h, 230V 3~, regulación integrada, versión básica"]
[null,"UR060HK102","heaterSteam 60 kg/h , 230Vac 3~, with regulation, full optional version","heaterSteam 60 kg/h, 230V 3~, regolazione integrata, versione full optional","heaterSteam 60 kg/h , 230Vac 3~, with regulation, full optional version","heaterSteam 60 kg/h , 230Vac 3~, avec régulateur, version toutes options","heaterSteam 60 kg/h , 230Vac 3~, mit Feuchte-Regelung, Vollversion","heaterSteam 60 kg/h, 230V 3~, regulación integrada, versión con todas las opciones"]
[null,"UR060HL003","heaterSteam process, 60 kg/h , 400Vac 3~, with regulation","heaterSteam process, 60 kg/h, 400V 3~, regolazione integrata","heaterSteam process, 60 kg/h , 400Vac 3~, with regulation","heaterSteam process, 60 kg/h , 400Vac 3~, avec régulateur","heaterSteam process, 60 kg/h , 400Vac 3~, mit Feuchte-Regelung","heaterSteam process, 60 kg/h, 400V 3~, regulación integrada"]
[null,"UR060HL103","heaterSteam 60 kg/h , 400Vac 3~, with regulation, Titanium version","heaterSteam 60 kg/h, 400V 3~, regolazione integrata, versione Titanium","heaterSteam 60 kg/h , 400Vac 3~, with regulation, Titanium version","heaterSteam 60 kg/h , 400Vac 3~, avec régulateur, version Titanium","heaterSteam 60 kg/h , 400Vac 3~, mit Feuchte-Regelung, Titanium","heaterSteam 60 kg/h, 400V 3~, regulación integrada, versión Titanium"]
[null,"UR060HM003","heaterSteam process, 60 kg/h , 460Vac 3~, with regulation","heaterSteam process, 60 kg/h, 460V 3~, regolazione integrata","heaterSteam process, 60 kg/h , 460Vac 3~, with regulation","heaterSteam process, 60 kg/h , 460Vac 3~, avec régulateur","heaterSteam process, 60 kg/h , 460Vac 3~, mit Feuchte-Regelung","heaterSteam process, 60 kg/h, 460V 3~, regulación integrada"]
[null,"UR060HM103","heaterSteam 60 kg/h , 460Vac 3~, with regulation, Titanium version","heaterSteam 60 kg/h, 460V 3~, regolazione integrata, versione Titanium","heaterSteam 60 kg/h , 460Vac 3~, with regulation, Titanium version","heaterSteam 60 kg/h , 460Vac 3~, avec régulateur, version Titanium","heaterSteam 60 kg/h , 460Vac 3~, mit Feuchte-Regelung, Titanium","heaterSteam 60 kg/h, 460V 3~, regulación integrada, versión Titanium"]
[null,"UR060HN002","heaterSteam 60 kg/h , 575Vac 3~, with regulation, basic version","heaterSteam 60 kg/h, 575V 3~, regolazione integrata, versione base","heaterSteam 60 kg/h , 575Vac 3~, with regulation, basic version","heaterSteam 60 kg/h , 575Vac 3~, avec régulateur, version de base","heaterSteam 60 kg/h , 575Vac 3~, mit Feuchte-Regelung, Grundversion","heaterSteam 60 kg/h, 575V 3~, regulación integrada, versión básica"]
[null,"UR060HN102","heaterSteam 60 kg/h , 575Vac 3~, with regulation, full optional version","heaterSteam 60 kg/h, 575V 3~, regolazione integrata, versione full optional","heaterSteam 60 kg/h , 575Vac 3~, with regulation, full optional version","heaterSteam 60 kg/h , 575Vac 3~, avec régulateur, version toutes options","heaterSteam 60 kg/h , 575Vac 3~, mit Feuchte-Regelung, Vollversion","heaterSteam 60 kg/h, 575V 3~, regulación integrada, versión con todas las opciones"]
[null,"UR060HW002","heaterSteam 60 kg/h , 208Vac 3~, with regulation, basic version","heaterSteam 60 kg/h, 208V 3~, regolazione integrata, versione base","heaterSteam 60 kg/h , 208Vac 3~, with regulation, basic version","heaterSteam 60 kg/h , 208Vac 3~, avec régulateur, version de base","heaterSteam 60 kg/h , 208Vac 3~, mit Feuchte-Regelung, Grundversion","heaterSteam 60 kg/h, 208V 3~, regulación integrada, versión básica"]
[null,"UR060HW102","heaterSteam 60 kg/h , 208Vac 3~, with regulation, full optional version","heaterSteam 60 kg/h, 208V 3~, regolazione integrata, versione full optional","heaterSteam 60 kg/h , 208Vac 3~, with regulation, full optional version","heaterSteam 60 kg/h , 208Vac 3~, avec régulateur, version toutes options","heaterSteam 60 kg/h , 208Vac 3~, mit Feuchte-Regelung, Vollversion","heaterSteam 60 kg/h, 208V 3~, regulación integrada, versión con todas las opciones"]
[null,"UR080HL003","heaterSteam process, 80 kg/h , 400Vac 3~, with regulation","heaterSteam process, 80 kg/h, 400V 3~, regolazione integrata","heaterSteam process, 80 kg/h , 400Vac 3~, with regulation","heaterSteam process, 80 kg/h , 400Vac 3~, avec régulateur","heaterSteam process, 80 kg/h , 400Vac 3~, mit Feuchte-Regelung","heaterSteam process, 80 kg/h, 400V 3~, regulación integrada"]
[null,"UR080HL103","heaterSteam 80 kg/h , 400Vac 3~, with regulation, Titanium version","heaterSteam 80 kg/h, 400V 3~, regolazione integrata, versione Titanium","heaterSteam 80 kg/h , 400Vac 3~, with regulation, Titanium version","heaterSteam 80 kg/h , 400Vac 3~, avec régulateur, version Titanium","heaterSteam 80 kg/h , 400Vac 3~, mit Feuchte-Regelung, Titanium","heaterSteam 80 kg/h, 400V 3~, regulación integrada, versión Titanium"]
[null,"UR080HM003","heaterSteam process, 80 kg/h , 460Vac 3~, with regulation","heaterSteam process, 80 kg/h, 460V 3~, regolazione integrata","heaterSteam process, 80 kg/h , 460Vac 3~, with regulation","heaterSteam process, 80 kg/h , 460Vac 3~, avec régulateur","heaterSteam process, 80 kg/h , 460Vac 3~, mit Feuchte-Regelung","heaterSteam process, 80 kg/h, 460V 3~, regulación integrada"]
[null,"UR080HM103","heaterSteam 80 kg/h , 460Vac 3~, with regulation, Titanium version","heaterSteam 80 kg/h, 460V 3~, regolazione integrata, versione Titanium","heaterSteam 80 kg/h , 460Vac 3~, with regulation, Titanium version","heaterSteam 80 kg/h , 460Vac 3~, avec régulateur, version Titanium","heaterSteam 80 kg/h , 460Vac 3~, mit Feuchte-Regelung, Titanium","heaterSteam 80 kg/h, 460V 3~, regulación integrada, versión Titanium"]
[null,"UR080HN002","heaterSteam 80 kg/h , 575Vac 3~, with regulation, basic version","heaterSteam 80 kg/h, 575V 3~, regolazione integrata, versione base","heaterSteam 80 kg/h , 575Vac 3~, with regulation, basic version","heaterSteam 80 kg/h , 575Vac 3~, avec régulateur, version de base","heaterSteam 80 kg/h , 575Vac 3~, mit Feuchte-Regelung, Grundversion","heaterSteam 80 kg/h, 575V 3~, regulación integrada, versión básica"]
[null,"UR080HN102","heaterSteam 80 kg/h , 575Vac 3~, with regulation, full optional version","heaterSteam 80 kg/h, 575V 3~, regolazione integrata, versione full optional","heaterSteam 80 kg/h , 575Vac 3~, with regulation, full optional version","heaterSteam 80 kg/h , 575Vac 3~, avec régulateur, version toutes options","heaterSteam 80 kg/h , 575Vac 3~, mit Feuchte-Regelung, Vollversion","heaterSteam 80 kg/h, 575V 3~, regulación integrada, versión con todas las opciones"]
[null,"UG045HD003","Gas-fired humidifier 45 kg/h - 230 Vac 1~ (UE market)","Umidificatore a gas 45 kg/h - 230 Vac 1~, controllo modulante con regolazione integrata (mercato EU)","Gas-fired humidifier 45 kg/h - 230 Vac 1~ (UE market)","Humidificateur à gaz 45 kg/h - 230 Vac 1~ (UE Market)","Gas-Dampfbefeuchter 45 kg/h - 230 Vac 1~  (UE Market)","humidificador a gas 45 kg/h - 230 Vca 1~, control modulante con regulación integrada  (UE Market)"]
[null,"UG090HD003","Gas-fired humidifier 90 kg/h - 230 Vac 1~(UE market)","Umidificatore a gas 90 kg/h - 230 Vac 1~, controllo modulante con regolazione integrata (mercato EU)","Gas-fired humidifier 90 kg/h - 230 Vac 1~(UE market)","Humidificateur à gaz 90 kg/h - 230 Vac 1~  (UE Market)","Gas-Dampfbefeuchter 90 kg/h - 230 Vac 1~  (UE Market)","humidificador a gas 90 kg/h - 230 Vca 1~, control modulante con regulación integrada (UE Market) "]
[null,"UG180HD003","Gas-fired humidifier 180 kg/h - 230 Vac 1~(UE market)","Umidificatore a gas 180 kg/h - 230 Vac 1~, controllo modulante con regolazione integrata (mercato EU)","Gas-fired humidifier 180 kg/h - 230 Vac 1~(UE market)","Humidificateur à gaz 180 kg/h - 230 Vac 1~  (UE Market)","Gas-Dampfbefeuchter 180 kg/h - 230 Vac 1~  (UE Market)","humidificador a gas 180 kg/h - 230 Vca 1~, control modulante con regulación integrada (UE Market) "]
[null,"UG045HD103","Gas-fired humidifier 45 kg/h - 230 Vac 1~(USA market)","Umidificatore a gas 45 kg/h - 230 Vac 1~, controllo modulante con regolazione integrata (meracto USA)","Gas-fired humidifier 45 kg/h - 230 Vac 1~(USA market)","Humidificateur à gaz 45 kg/h - 230 Vac 1~ (USA Market)","Gas-Dampfbefeuchter 45 kg/h - 230 Vac 1~  (USA Market)","humidificador a gas 45 kg/h - 230 Vca 1~, control modulante con regulación integrada  (USA Market)"]
[null,"UG090HD103","Gas-fired humidifier 90 kg/h - 230 Vac 1~ (USA market)","Umidificatore a gas 90 kg/h - 230 Vac 1~, controllo modulante con regolazione integrata (mercato USA)","Gas-fired humidifier 90 kg/h - 230 Vac 1~ (USA market)","Humidificateur à gaz 90 kg/h - 230 Vac 1~ (USA Market)","Gas-Dampfbefeuchter 90 kg/h - 230 Vac 1~  (USA Market)","humidificador a gas 90 kg/h - 230 Vca 1~, control modulante con regulación integrada (USA Market) "]
[null,"UG180HD103","Gas-fired humidifier 180 kg/h - 230 Vac 1~ (USA market)","Umidificatore a gas 180 kg/h - 230 Vac 1~, controllo modulante con regolazione integrata (mercato USA)","Gas-fired humidifier 180 kg/h - 230 Vac 1~ (USA market)","Humidificateur à gaz 180 kg/h - 230 Vac 1 ~(USA Market)","Gas-Dampfbefeuchter 180 kg/h - 230 Vac 1~  (USA Market)","humidificador a gas 180 kg/h - 230 Vca 1~, control modulante con regulación integrada (USA Market) "]
[null,"WARNING","WARNING: the pre-heating must be supplied by an external device","ATTENZIONE: il preriscaldo deve essere fornito da un dispositivo esterno","WARNING: the pre-heating must be supplied by an external device","WARNING: the pre-heating must be supplied by an external device","WARNING: the pre-heating must be supplied by an external device","WARNING: the pre-heating must be supplied by an external device"]
[]
[null,{"$f":"CONCATENATE(IF(A519=1,\" \",\"\"),C519)","v":"WARNING: the input steam flow generates condensation"},"WARNING: the input steam flow generates condensation","ATTENZIONE: la portata di vapore indicata genera condensazione","WARNING: the input steam flow generates condensation","ATTENTION  - le jet de vapeur indiqué produit de la condensation","ACHTUNG: Der angegebene Dampffluss führt zur Kondensatbildung"]
[]
[null,null,"View Partial net prices","Visuallizzare prezzi netti parziali","View Partial net prices","View Partial net prices","View Partial net prices","View Partial net prices"]
[null,null,"WTS revers osmosis system","Sistema WTS a osmosi inversa","WTS revers osmosis system","WTS revers osmosis system","WTS revers osmosis system","WTS revers osmosis system"]
[null,"ROL1005U00","Reverse osmosis system 100 l / h - 230V 50Hz - for steel","Sistema osmosi inversa 100 l/h – 230V 50Hz – per acciaio","Reverse osmosis system 100 l / h - 230V 50Hz - for steel","Reverse osmosis system 100 l / h - 230V 50Hz - for steel","Reverse osmosis system 100 l / h - 230V 50Hz - for steel","Reverse osmosis system 100 l / h - 230V 50Hz - for steel"]
[null,"ROL1006U00","Reverse osmosis system 100 l / h - 230V 60Hz - for steel","Sistema osmosi inversa 100 l/h – 230V 60Hz – per acciaio","Reverse osmosis system 100 l / h - 230V 60Hz - for steel","Reverse osmosis system 100 l / h - 230V 60Hz - for steel","Reverse osmosis system 100 l / h - 230V 60Hz - for steel","Reverse osmosis system 100 l / h - 230V 60Hz - for steel"]
[null,"ROL3205U00","Reverse osmosis system 320 l / h - 230V 50Hz - for steel","Sistema osmosi inversa 320 l/h – 230V 50Hz – per acciaio","Reverse osmosis system 320 l / h - 230V 50Hz - for steel","Reverse osmosis system 320 l / h - 230V 50Hz - for steel","Reverse osmosis system 320 l / h - 230V 50Hz - for steel","Reverse osmosis system 320 l / h - 230V 50Hz - for steel"]
[null,"ROL3206U00","Reverse osmosis system 320 l / h - 230V 60Hz - for steel","Sistema osmosi inversa 320 l/h – 230V 60Hz – per acciaio","Reverse osmosis system 320 l / h - 230V 60Hz - for steel","Reverse osmosis system 320 l / h - 230V 60Hz - for steel","Reverse osmosis system 320 l / h - 230V 60Hz - for steel","Reverse osmosis system 320 l / h - 230V 60Hz - for steel"]
[null,"ROC0605000","Reverse osmosis system 60 l / h - 230V 50Hz - for steel","Sistema osmosi inversa 60 l/h – 230V 50Hz – per acciaio","Reverse osmosis system 60 l / h - 230V 50Hz - for steel","Reverse osmosis system, 60 l/h – 230V 50 Hz – for steel","Reverse osmosis system, 60 l/h – 230V 50 Hz – for steel","Reverse osmosis system, 60 l/h – 230V 50 Hz – for steel"]
[null,"ROC0606000","Reverse osmosis system 60 l / h - 230V 60Hz - for steel","Sistema osmosi inversa 60 l/h – 230V 60Hz – per acciaio","Reverse osmosis system 60 l / h - 230V 60Hz - for steel","Reverse osmosis system 60 l / h - 230V 60Hz - for steel","Reverse osmosis system 60 l / h - 230V 60Hz - for steel","Reverse osmosis system 60 l / h - 230V 60Hz - for steel"]
[null,"ROC025500N","WTS compact 25 KG/H with pump","WTS compact 25 KG/H CON POMPA","WTS compact 25 KG/H with pump","WTS compact 25 KG/H with pump","WTS compact 25 KG/H with pump","WTS compact 25 KG/H with pump"]
[null,null,"grid frequency","Frequenza di rete","grid frequency","grid frequency","grid frequency","grid frequency"]
[]
[]
[null,"ROKC00KTVE","Kit expansion vessel with hoses and fittings","Kit vaso di espansione con tubi e raccordi","Kit expansion vessel with hoses and fittings","Kit expansion vessel with hoses and fittings","Kit expansion vessel with hoses and fittings","Kit expansion vessel with hoses and fittings"]
[null,"AUC1000000","AUTOCLAVE 100 Liters (expansion vessel)","AUTOCLAVE 100 LITRI VERTICALE (Vaso di espansione)","AUTOCLAVE 100 Liters (expansion vessel)","AUTOCLAVE 100 Liters (expansion vessel)","AUTOCLAVE 100 Liters (expansion vessel)","AUTOCLAVE 100 Liters (expansion vessel)"]
[null,"AUC2000000","AUTOCLAVE 200 Liters (expansion vessel)","AUTOCLAVE 200 LITRI VERTICALE (vaso di espansione)","AUTOCLAVE 200 Liters (expansion vessel)","AUTOCLAVE 200 Liters (expansion vessel)","AUTOCLAVE 200 Liters (expansion vessel)","AUTOCLAVE 200 Liters (expansion vessel)"]
[null,"AUC3000000","AUTOCLAVE 300 Liters (expansion vessel)","AUTOCLAVE 300 LITRI VERTICALE (vaso di espansione)","AUTOCLAVE 300 Liters (expansion vessel)","AUTOCLAVE 300 Liters (expansion vessel)","AUTOCLAVE 300 Liters (expansion vessel)","AUTOCLAVE 300 Liters (expansion vessel)"]
[]
[]
[null,"ROKL00AS01","Antiscale liquid 25Kg (antiscalant)","Antiscalant 25Kg","Antiscale liquid 25Kg (antiscalant)","Antiscale liquid 25Kg (antiscalant)","Antiscale liquid 25Kg (antiscalant)","Antiscale liquid 25Kg (antiscalant)"]
[null,"ROKL00AS00","Antiscale liquid NSF- 25Kg (antiscalant)","Antiscalant NSF - 25Kg","Antiscale liquid NSF- 25Kg (antiscalant)","Antiscale liquid NSF- 25Kg (antiscalant)","Antiscale liquid NSF- 25Kg (antiscalant)","Antiscale liquid NSF- 25Kg (antiscalant)"]
[null,null,"No NSF Certification","Senza Certificazione NSF","No NSF Certification","No NSF Certification","No NSF Certification","No NSF Certification"]
[null,null,"With NSF Certification","Con Certificazione NSF","With NSF Certification","With NSF Certification","With NSF Certification","With NSF Certification"]
[null,null,"Net price","Prezzo netto","Net price","Net price","Net price","Net price"]
[null,null,"For short absorption distance, take into account the installation of ultimateSAM distributors","Per brevi distanze di assorbimento, valutare l'installazione di distributori  ultimateSAM ","For short absorption distance, take into account the installation of ultimateSAM distributors","For short absorption distance, take into account the installation of ultimateSAM distributors","For short absorption distance, take into account the installation of ultimateSAM distributors","For short absorption distance, take into account the installation of ultimateSAM distributors"]
[null,null," ","[3] Durata massima in cantiere: 4 h.\nAttività:\nAiuto tecnico-pratico all'installatore per i collegamenti\n- idrici\n- di segnale interni della macchina\n- per la distribuzione del vapore (posizionamento lance\nprevio forature già predisposte da parte del cliente)\n- AVVIAMENTO UMIDIFICATORE"," "," "," "," "]
[null,null,"Note:","Note:","Note:","Note:","Note:","Note:"]
[null,null,"HMCOMMKF0","HMCOMMKF0","HMCOMMKF0","HMCOMMKF0","HMCOMMKF0","HMCOMMKF0"]
[null,null,"HMMTCT000","HMMTCT000","HMMTCT000","HMMTCT000","HMMTCT000","HMMTCT000"]
[null,null,"Choise of the Steam Distributor (if required)","Scelta del distributore di vapore (se richiesto)","Choise of the Steam Distributor (if required)","Choise of the Steam Distributor (if required)","Choise of the Steam Distributor (if required)","Choise of the Steam Distributor (if required)"]
[null,null,"Steam distributor suggested automatically by the tool","Distributore di vapore suggerito automaticamente dal tool","Steam distributor suggested automatically by the tool","Steam distributor suggested automatically by the tool","Steam distributor suggested automatically by the tool","Steam distributor suggested automatically by the tool"]
[null,null,"Choice of steam distributor by the user (not automatically by the tool)","Scelta del distributore di vapore dall'utente (non automaticamente dal tool)","Choice of steam distributor by the user (not automatically by the tool)","Choice of steam distributor by the user (not automatically by the tool)","Choice of steam distributor by the user (not automatically by the tool)","Choice of steam distributor by the user (not automatically by the tool)"]
[null,null,"Insert the required Steam Distributor code(1)","Inserisci il codice del Distributore di vapore desiderato (1)","Insert the required Steam Distributor code(1)","Insert the required Steam Distributor code(1)","Insert the required Steam Distributor code(1)","Insert the required Steam Distributor code(1)"]
[null,null,"Attention! DP code non recognized","ATTENZIONE: Codice del DP non riconosciuto","Attention! DP code non recognized","Attention! DP code non recognized","Attention! DP code non recognized","Attention! DP code non recognized"]
[null,null,"Steam distributor code","Codice del Distributore di Vapore","Steam distributor code","Steam distributor code","Steam distributor code","Steam distributor code"]
[null,null,"(1)\"Special application\" DP code included","(1) Comprende anche DP per applicazioni speciali","(1)\"Special application\" DP code included","(1)\"Special application\" DP code included","(1)\"Special application\" DP code included","(1)\"Special application\" DP code included"]
[null,null,"Humidification load","Carico di umidificazione","Humidification load","Humidification load","Humidification load","Humidification load"]
[null,null,"Internal lenght","Lunghezza interna","Internal lenght","Internal lenght","Internal lenght","Internal lenght"]
[null,null,"STEP 4","STEP 4","STEP 4","STEP 4","STEP 4","STEP 4"]
[null,null,"Chosen by the tool","Scelto automaticamente dal tool","Chosen by the tool","Chosen by the tool","Chosen by the tool","Chosen by the tool"]
[null,null,"Chosen by the user","Scelto dall'utente","Chosen by the user","Chosen by the user","Chosen by the user","Chosen by the user"]
[]
[null,null,"Currency","Valuta","Currency","Monnaie","Währung","Moneda"]
[null,null,"Exchange rate","Tasso di cambio","Exchange rate","Taux de change","Wechselkurs","Cambio"]
{"$rows_empty":157}
["ENGLISH"]
{"$rows_empty":11}
["ENGLISH"]
{"$rows_empty":8}
["ENGLISH"]
["ITALIANO","Ultima selezione"]
["ENGLISH"]
["FRANÇAIS "]
["DEUTSCH"]
["ESPAÑOL "]
[]
["UE130XL000010440UG180HD002010440","Macro"]
[]
[]
[null,null,"Commissioning ","Avviamento della macchina","Commissioning "]
[null,null,"Commissioning WTS system","Avviamento del WTS","Commissioning WTS system"]
[null,null,"Commissioning for the 1st humidification system","Avviamento della prima macchina","Commissioning for the 1st humidification system"]
[null,null,"Commissioning for the first 2 humidification systems","Avviamento per le prime due macchine","Commissioning for the first 2 humidification systems"]
[null,null,"Commissioning for EXTRA humidification system","Avviamento Macchine Extra","Commissioning for EXTRA humidification system"]
[null,null," ","(Prezzo valido per distanze inferiori a 50 Km dal centro di assistenza)"," "]
[null,null,"Commissioning for the 1st WTS system","Avviamento WTS della prima macchina","Commissioning for the 1st WTS system"]
[null,null,"Commissioning for EXTRA WTS system","Avviamento WTS macchine EXTRA","Commissioning for EXTRA WTS system"]
[null,null,"Training- 2 h at yard","Training Teorico-2h in cantiere","Training- 2 h at yard"]
[null,null,"Contact Carel S.p.a","Contattare Carel S.p.a","Contact Carel S.p.a","Contacter Carel S.p.a","Bitte das CAREL KONTAKTIEREN","Pongase en contacto con Carel S.p.a"]
[null,null,"Attention! Number of humidifiers and number of commissioning are not equal","Attenzione! Il numero delle Macchine è diverso dal numero di avviamenti","Attention! Number of humidifiers and number of commissioning are not equal"]
[null,null,"Total","Totale","Total"]
[null,null,"Total Service Costs","Tot Costo servizi","Total Service Costs"]
[null,null,"Tecnical and practical support","Supporto tecnico pratico","Tecnical and practical support"]
[null,null,"[1] Commissioning not included","[1] Non include avviamento","[1] Commissioning not included"]
[null,null," ","[2]Incontro con capocantiere per consulenza tecnica nella fase di pre-installazione (ad umidificatore già venduto) per tipologia di umidificatore con spiegazione\ndello stesso (Manuale d'uso alla mano). Compilazione di una check list approfondita riferita al manuale d'uso utilizzato (cod. manuale + pagina di riferimento)."," "," "," "," "]
{"$rows_empty":174}
["ITALIANO"]

{"sheet":"GRAFICI","index":2,"n_rows":102,"n_cols":44,"rows_kept":102,"hidden":true,"merged":[[0,0,0,1],[0,2,0,4]]}
["Coeff. Psat",null,"Altri coefficienti"]
[-5674.359,-5800.2206,"c.s. aria J/(°C*g)=",null,1.006,{"$nulls":3},"Errore nella prima iterazione",{"$nulls":3},{"$f":"DESIGN!W59","v":{"v":0,"d":"0.00E+00"}}]
[6.3925247,1.3914993,"c.s. vapo J/(°C*g)=",null,1.805,{"$nulls":3},"Valore di k della prima iterazione",{"$nulls":3},3]
[-0.009677843,-0.048640239,"c latente J/g=",null,2501]
[6.2215701e-07,4.1764768e-05,"R Joule/Kmole*°K=",null,8313.6]
[2.0747825e-09,-1.4452093e-08,"P atm Pa =",null,{"$f":"101325*(1-$B$12*0.0000225577)^5.2559","v":101325},{"$nulls":3},"Numero massimo di umidificatori ammissibili",{"$nulls":3},{"$f":"DESIGN!E86","v":1},"Valore massimo 99"]
[-9.484024e-13,0,"f s",null,1.004,{"$nulls":3},"Percentuale da cui considerare la portata",{"$nulls":3},{"v":0.5,"d":"50%"}]
[4.1635019,6.5459673,"0 °C = °K",null,273.15]
[]
["t start °C",-5,{"$nulls":6},"Visualezzare possibilità raccordi (Si o No?)",{"$nulls":3},"Si"]
["t step °C",2,{"$nulls":6},"Limite altezza condotta mm",{"$nulls":3},200]
["H slm m",{"$f":"DESIGN!E33","v":0}]
[]
[]
[]
[]
[]
[{"$nulls":13},"h","h","h","h","h","h","h","h","h","h","h","h","h","h","h","h","h","h","h","h","h","h","h","h","h","h","h","h","h","h","h"]
[{"$nulls":13},{"$f":"$E$2*N20+N21*($E$4+$E$3*N20)/1000","v":{"v":1.1690960621912332,"d":"1.2"}},{"$f":"$E$2*O20+O21*($E$4+$E$3*O20)/1000","v":{"v":4.343467847589399,"d":"4.3"}},{"v":7.71488584572945,"d":"7.7"},{"v":11.207643175776152,"d":"11.2"},{"v":14.81598751207514,"d":"14.8"},{"v":18.64448612961185,"d":"18.6"},{"v":22.719587874073632,"d":"22.7"},{"v":27.070527326293465,"d":"27.1"},{"v":31.729603951125092,"d":"31.7"},{"v":36.73249494128796,"d":"36.7"},{"v":42.118607528360215,"d":"42.1"},{"v":47.93147772121473,"d":"47.9"},{"v":54.21922388241447,"d":"54.2"},{"v":61.03506533022278,"d":"61.0"},{"v":68.43791834141179,"d":"68.4"},{"v":76.49308463603003,"d":"76.5"},{"v":85.27305079064112,"d":"85.3"},{"v":94.85842123598414,"d":"94.9"},{"v":105.33901279268258,"d":"105.3"},{"v":116.8151454092459,"d":"116.8"},{"v":129.39917232522345,"d":"129.4"},{"v":143.21730387695504,"d":"143.2"},{"v":158.41179339436334,"d":"158.4"},{"v":175.1435722051153,"d":"175.1"},{"v":193.59544519343632,"d":"193.6"},{"v":213.97599079375863,"d":"214.0"},{"v":236.52435276328748,"d":"236.5"},{"v":261.51616991229065,"d":"261.5"},{"v":289.2709704700949,"d":"289.3"},{"v":320.1614691772102,"d":"320.2"},{"v":354.62536130370023,"d":"354.6"}]
[{"$nulls":3},"x da UR",{"$nulls":9},{"$f":"$B$10","v":-5},{"$f":"N20+$B$11","v":-3},{"$f":"O20+$B$11","v":-1},1,3,5,7,9,11,13,15,17,19,21,23,25,27,29,31,33,35,37,39,41,43,45,47,49,51,53,55]
["t °C","T °K","Pvs Pa",{"v":0.1,"d":"10%"},{"v":0.2,"d":"20%"},{"v":0.3,"d":"30%"},{"v":0.4,"d":"40%"},{"v":0.5,"d":"50%"},{"v":0.6,"d":"60%"},{"v":0.7,"d":"70%"},{"v":0.8,"d":"80%"},{"v":0.9,"d":"90%"},{"v":1,"d":"100%"},{"$f":"M22","v":{"v":2.487623696943683,"d":"2.49"}},{"$f":"M23","v":{"v":2.949796479618766,"d":"2.95"}},{"$f":"M24","v":{"v":3.4894779501917412,"d":"3.49"}},{"$f":"M25","v":{"v":4.076083904169982,"d":"4.08"}},{"$f":"M26","v":{"v":4.70711654377872,"d":"4.71"}},{"$f":"M27","v":{"v":5.424044035263333,"d":"5.42"}},{"$f":"M28","v":{"v":6.237018450997711,"d":"6.24"}},{"$f":"M29","v":{"v":7.157240287017539,"d":"7.16"}},{"$f":"M30","v":{"v":8.1970616918169,"d":"8.20"}},{"$f":"M31","v":{"v":9.370102156808654,"d":"9.37"}},{"$f":"M32","v":{"v":10.691378827115578,"d":"10.69"}},{"$f":"M33","v":{"v":12.177454036033211,"d":"12.18"}},{"$f":"M34","v":{"v":13.846603208863057,"d":"13.85"}},{"$f":"M35","v":{"v":15.719006945995526,"d":"15.72"}},{"$f":"M36","v":{"v":17.81697191222541,"d":"17.82"}},{"$f":"M37","v":{"v":20.1651861695832,"d":"20.17"}},{"$f":"M38","v":{"v":22.791015846996306,"d":"22.79"}},{"$f":"M39","v":{"v":25.724851610724027,"d":"25.72"}},{"$f":"M40","v":{"v":29.000515375781973,"d":"29.00"}},{"$f":"M41","v":{"v":32.655740201575,"d":"32.66"}},{"$f":"M42","v":{"v":36.732739506946075,"d":"36.73"}},{"$f":"M43","v":{"v":41.27888584011319,"d":"41.28"}},{"$f":"M44","v":{"v":46.34752474604771,"d":"46.35"}},{"$f":"M45","v":{"v":51.998956198188075,"d":"52.00"}},{"$f":"M46","v":{"v":58.30162517220924,"d":"58.30"}},{"$f":"M47","v":{"v":65.33357503461497,"d":"65.33"}},{"$f":"M48","v":{"v":73.18423362793351,"d":"73.18"}},{"$f":"M49","v":{"v":81.95662387588486,"d":"81.96"}},{"$f":"M50","v":{"v":91.77012075335654,"d":"91.77"}},{"$f":"M51","v":{"v":102.76391801684477,"d":"102.76"}},{"$f":"M52","v":{"v":115.10142631210171,"d":"115.10"}}]
[{"$f":"$B$10","v":-5},{"$f":"A22+$E$8","v":268.15},{"$f":"IF(A22<0,EXP($A$2/B22+$A$3+$A$4*B22+$A$5*(B22^2)+$A$6*(B22^3)+$A$7*(B22^4)+$A$8*LN(B22)),EXP($B$2/B22+$B$3+$B$4*B22+$B$5*(B22^2)+$B$6*(B22^3)+$B$7*(B22^4)+$B$8*LN(B22)))","v":402.02925588076624},{"$f":"0.62198*1000*$E$7*D$21*$C22/($E$6-$E$7*D$21*$C22)","v":{"v":0.2478701434517979,"d":"0.25"}},{"v":0.49593792702886635,"d":"0.50"},{"v":0.7442035872090509,"d":"0.74"},{"v":0.9926673608476103,"d":"0.99"},{"v":1.2413294851779706,"d":"1.24"},{"v":1.4901901978124805,"d":"1.49"},{"v":1.7392497367431665,"d":"1.74"},{"v":1.988508340342494,"d":"1.99"},{"v":2.2379662473641253,"d":"2.24"},{"v":2.487623696943683,"d":"2.49"},{"$f":"1000*(N$19-$E$2*$A22)/($E$4+$E$3*$A22)","v":{"v":2.487623696943683,"d":"2.49"}},{"v":3.761461430226788,"d":"3.76"},{"v":5.1143714707127685,"d":"5.11"},{"v":6.515973545391167,"d":"6.52"},{"v":7.963959314228731,"d":"7.96"},{"v":9.500290383977308,"d":"9.50"},{"v":11.135580362593378,"d":"11.14"},{"v":12.881560740494374,"d":"12.88"},{"v":14.751192909690143,"d":"14.75"},{"v":16.758793704306008,"d":"16.76"},{"v":18.92017677880405,"d":"18.92"},{"v":21.252812616986418,"d":"21.25"},{"v":23.776010546821084,"d":"23.78"},{"v":26.511126849275282,"d":"26.51"},{"v":29.481803927170933,"d":"29.48"},{"v":32.71424658595292,"d":"32.71"},{"$f":"1000*(AD$19-$E$2*$A22)/($E$4+$E$3*$A22)","v":{"v":36.23754282873669,"d":"36.24"}},{"v":40.08403825719927,"d":"40.08"},{"v":44.289775295772465,"d":"44.29"},{"v":48.89501114948822,"d":"48.90"},{"v":53.944831840296736,"d":"53.94"},{"v":59.489884078674564,"d":"59.49"},{"v":65.58725243807154,"d":"65.59"},{"v":72.30151675081625,"d":"72.30"},{"v":79.70603444795246,"d":"79.71"},{"v":87.88450558041659,"d":"87.88"},{"v":96.93289570051365,"d":"96.93"},{"v":106.96181539232563,"d":"106.96"},{"v":118.09948754305115,"d":"118.10"},{"v":130.4954781557641,"d":"130.50"},{"v":144.32542914904852,"d":"144.33"}]
[{"$f":"A22+$B$11","v":-3},270.15,476.36925078401833,{"v":0.2937259283271345,"d":"0.29"},{"v":0.5877294079677525,"d":"0.59"},{"v":0.8820108325088908,"d":"0.88"},{"v":1.176570596282116,"d":"1.18"},{"v":1.4714090943652869,"d":"1.47"},{"v":1.7665267225843204,"d":"1.77"},{"v":2.061923877514961,"d":"2.06"},{"v":2.3576009564845615,"d":"2.36"},{"v":2.653558357573859,"d":"2.65"},{"v":2.949796479618766,"d":"2.95"},{"v":1.6778014221880773,"d":"1.68"},{"v":2.949796479618766,"d":"2.95"},{"v":4.3007494618413915,"d":"4.30"},{"v":5.700324042569639,"d":"5.70"},{"v":7.146215220910182,"d":"7.15"},{"v":8.680323903858955,"d":"8.68"},{"v":10.313248346208859,"d":"10.31"},{"v":12.056703068135713,"d":"12.06"},{"v":13.923630712287938,"d":"13.92"},{"v":15.928327402708366,"d":"15.93"},{"v":18.086583918544235,"d":"18.09"},{"v":20.415845471588717,"d":"20.42"},{"v":22.935393457812282,"d":"22.94"},{"v":25.666553265155375,"d":"25.67"},{"v":28.63293309641298,"d":"28.63"},{"v":31.86069985034773,"d":"31.86"},{"v":35.3788994526899,"d":"35.38"},{"v":39.21983071543711,"d":"39.22"},{"v":43.419483925685796,"d":"43.42"},{"v":48.01805805422212,"d":"48.02"},{"v":53.06057390360314,"d":"53.06"},{"v":58.59760492107262,"d":"58.60"},{"v":64.68615310412723,"d":"64.69"},{"v":71.39070486684096,"d":"71.39"},{"v":78.7845115247272,"d":"78.78"},{"v":86.95115205202733,"d":"86.95"},{"v":95.98645318163376,"d":"95.99"},{"v":106.00086549337756,"d":"106.00"},{"v":117.12242639304807,"d":"117.12"},{"v":129.5004855283271,"d":"129.50"},{"v":143.31043074217075,"d":"143.31"}]
[-1,272.15,563.0373901654226,{"v":0.34719472337942703,"d":"0.35"},{"v":0.6947772775648197,"d":"0.69"},{"v":1.0427483127538022,"d":"1.04"},{"v":1.3911084805982192,"d":"1.39"},{"v":1.7398584342082015,"d":"1.74"},{"v":2.08899882815625,"d":"2.09"},{"v":2.4385303184813285,"d":"2.44"},{"v":2.7884535626929763,"d":"2.79"},{"v":3.138769219775425,"d":"3.14"},{"v":3.4894779501917412,"d":"3.49"},{"v":0.8703186674874244,"d":"0.87"},{"v":2.1404763724276816,"d":"2.14"},{"v":3.4894779501917417,"d":"3.49"},{"v":4.887030894258412,"d":"4.89"},{"v":6.330833533227755,"d":"6.33"},{"v":7.862726249697142,"d":"7.86"},{"v":9.49329198965012,"d":"9.49"},{"v":11.234228352046744,"d":"11.23"},{"v":13.098459284339594,"d":"13.10"},{"v":15.100260260319004,"d":"15.10"},{"v":17.255399249902556,"d":"17.26"},{"v":19.581296265883505,"d":"19.58"},{"v":22.097204852928428,"d":"22.10"},{"v":24.824419595198766,"d":"24.82"},{"v":27.786514594264066,"d":"27.79"},{"v":31.009618951714465,"d":"31.01"},{"v":34.522736637453704,"d":"34.52"},{"v":38.35811980897214,"d":"38.36"},{"v":42.55170676665189,"d":"42.55"},{"v":47.14363841526807,"d":"47.14"},{"v":52.178870526398875,"d":"52.18"},{"v":57.707903495707626,"d":"57.71"},{"v":63.78765698329395,"d":"63.79"},{"v":70.48252425485619,"d":"70.48"},{"v":77.86565081693757,"d":"77.87"},{"v":86.02049491686668,"d":"86.02"},{"v":95.04274486916286,"d":"95.04"},{"v":105.04269171164741,"d":"105.04"},{"v":116.1481879045432,"d":"116.15"},{"v":128.50836736517564,"d":"128.51"},{"v":142.29836459487962,"d":"142.30"}]
[1,274.15,657.0717179813817,{"v":0.4052183879508096,"d":"0.41"},{"v":0.8109651176129982,"d":"0.81"},{"v":1.2172412229736889,"d":"1.22"},{"v":1.6240477407198417,"d":"1.62"},{"v":2.031385710247071,"d":"2.03"},{"v":2.439256173668498,"d":"2.44"},{"v":2.847660175823637,"d":"2.85"},{"v":3.256598764287318,"d":"3.26"},{"v":3.666072989378644,"d":"3.67"},{"v":4.076083904169982,"d":"4.08"},{"v":0.06516530939934721,"d":"0.07"},{"v":1.333490962176198,"d":"1.33"},{"v":2.68054676482165,"d":"2.68"},{"v":4.076083904169982,"d":"4.08"},{"v":5.517804028709843,"d":"5.52"},{"v":7.047487171238609,"d":"7.05"},{"v":8.675701013092764,"d":"8.68"},{"v":10.414126280830295,"d":"10.41"},{"v":12.275668280639161,"d":"12.28"},{"v":14.27458189562829,"d":"14.27"},{"v":16.42661235228482,"d":"16.43"},{"v":18.749154537095272,"d":"18.75"},{"v":21.26143422376672,"d":"21.26"},{"v":23.984715281543224,"d":"23.98"},{"v":26.94253780914286,"d":"26.94"},{"v":30.160993220019154,"d":"30.16"},{"v":33.66904364928196,"d":"33.67"},{"v":37.49889473450155,"d":"37.50"},{"v":41.686432939315125,"d":"41.69"},{"v":46.271741269993434,"d":"46.27"},{"v":51.299710654734774,"d":"51.30"},{"v":56.82076864835856,"d":"56.82"},{"v":62.891752811091294,"d":"62.89"},{"v":69.57696352896663,"d":"69.58"},{"v":76.94944080479155,"d":"76.95"},{"v":85.09252250725032,"d":"85.09"},{"v":94.10175893179353,"d":"94.10"},{"v":104.0872820344736,"d":"104.09"},{"v":115.17675986347116,"d":"115.18"},{"v":127.51911122808619,"d":"127.52"},{"v":141.28921801886295,"d":"141.29"}]
[3,276.15,758.0312052006951,{"v":0.46752725176795235,"d":"0.47"},{"v":0.9357578900027254,"d":"0.94"},{"v":1.4046935032480024,"d":"1.40"},{"v":1.874335684834541,"d":"1.87"},{"v":2.3446860328982173,"d":"2.34"},{"v":2.8157461503981556,"d":"2.82"},{"v":3.287517645134937,"d":"3.29"},{"v":3.7600021297688917,"d":"3.76"},{"v":4.233201221838473,"d":"4.23"},{"v":4.70711654377872,"d":"4.71"},{"v":-0.7376687171951838,"d":"-0.74"},{"v":0.5288301608430365,"d":"0.53"},{"v":1.8739457933859516,"d":"1.87"},{"v":3.2674729347598666,"d":"3.27"},{"v":4.707116543778719,"d":"4.71"},{"v":6.234596477284029,"d":"6.23"},{"v":7.860465195936679,"d":"7.86"},{"v":9.596386602495382,"d":"9.60"},{"v":11.455247415581654,"d":"11.46"},{"v":13.451281986936703,"d":"13.45"},{"v":15.600212865132155,"d":"15.60"},{"v":17.919409882726814,"d":"17.92"},{"v":20.42807112246554,"d":"20.43"},{"v":23.14742982715264,"d":"23.15"},{"v":26.100992190603627,"d":"26.10"},{"v":29.314812046700183,"d":"29.31"},{"v":32.8178098162679,"d":"32.82"},{"v":36.642144750962686,"d":"36.64"},{"v":40.823651626998156,"d":"40.82"},{"v":45.4023557189236,"d":"45.40"},{"v":50.42308329834582,"d":"50.42"},{"v":55.93618928906627,"d":"55.94"},{"v":61.99842938793589,"d":"62.00"},{"v":68.6740113688736,"d":"68.67"},{"v":76.03587003486507,"d":"76.04"},{"v":84.16722322271397,"d":"84.17"},{"v":93.16348360638102,"d":"93.16"},{"v":103.13462451840205,"d":"103.13"},{"v":114.20813012613432,"d":"114.21"},{"v":126.53270475049433,"d":"126.53"},{"v":140.2829783989085,"d":"140.28"}]
[5,278.15,872.4866542640299,{"v":0.5381804685057786,"d":"0.54"},{"v":1.0772930861124963,"d":"1.08"},{"v":1.6173402766959766,"d":"1.62"},{"v":2.158324472543103,"d":"2.16"},{"v":2.7002481143883315,"d":"2.70"},{"v":3.2431136514504013,"d":"3.24"},{"v":3.786923541469227,"d":"3.79"},{"v":4.331680250742996,"d":"4.33"},{"v":4.877386254165441,"d":"4.88"},{"v":5.424044035263333,"d":"5.42"},{"v":-1.5381934195112665,"d":"-1.54"},{"v":-0.2735160615573953,"d":"-0.27"},{"v":1.0696649817151023,"d":"1.07"},{"v":2.461187906804176,"d":"2.46"},{"v":3.898760973327014,"d":"3.90"},{"v":5.424044035263333,"d":"5.42"},{"v":7.047574376380167,"d":"7.05"},{"v":8.780999124030025,"d":"8.78"},{"v":10.637186462734471,"d":"10.64"},{"v":12.630350271924764,"d":"12.63"},{"v":14.776190487489252,"d":"14.78"},{"v":17.092051960125787,"d":"17.09"},{"v":19.597105161269095,"d":"19.60"},{"v":22.312552795379638,"d":"22.31"},{"v":25.26186724889664,"d":"25.26"},{"v":28.471064884226266,"d":"28.47"},{"v":31.96902452789957,"d":"31.97"},{"v":35.78785917908552,"d":"35.79"},{"v":39.96335207525127,"d":"39.96"},{"v":44.53547092528795,"d":"44.54"},{"v":49.548977530193305,"d":"49.55"},{"v":55.05415439167141,"d":"55.05"},{"v":61.10767557867485,"d":"61.11"},{"v":67.77365651940332,"d":"67.77"},{"v":75.12492711962483,"d":"75.12"},{"v":83.24458552953003,"d":"83.24"},{"v":92.2279071974532,"d":"92.23"},{"v":102.18470728868863,"d":"102.18"},{"v":113.242286618697,"d":"113.24"},{"v":125.5491356369798,"d":"125.55"},{"v":139.27963319237867,"d":"139.28"}]
[7,280.15,1001.9596471468182,{"v":0.6181233345713898,"d":"0.62"},{"v":1.2374764724863387,"d":"1.24"},{"v":1.858063087580336,"d":"1.86"},{"v":2.4798868683367643,"d":"2.48"},{"v":3.102951517959973,"d":"3.10"},{"v":3.727260754448797,"d":"3.73"},{"v":4.352818310670506,"d":"4.35"},{"v":4.979627934435206,"d":"4.98"},{"v":5.607693388570686,"d":"5.61"},{"v":6.237018450997711,"d":"6.24"},{"v":-2.336418747275864,"d":"-2.34"},{"v":-1.0735576773917457,"d":"-1.07"},{"v":0.2676943333974304,"d":"0.27"},{"v":1.6572187989808194,"d":"1.66"},{"v":3.092727270297851,"d":"3.09"},{"v":4.615819770814715,"d":"4.62"},{"v":6.23701845099771,"d":"6.24"},{"v":7.967953710977713,"d":"7.97"},{"v":9.82147525441247,"d":"9.82"},{"v":11.811776547226609,"d":"11.81"},{"v":13.954534977576381,"d":"13.95"},{"v":16.267070486054948,"d":"16.27"},{"v":18.768526012095816,"d":"18.77"},{"v":21.480073809531923,"d":"21.48"},{"v":24.425152554532293,"d":"24.43"},{"v":27.62974124565819,"d":"27.63"},{"v":31.122677234618834,"d":"31.12"},{"v":34.93602740094887,"d":"34.94"},{"v":39.1055235914055,"d":"39.11"},{"v":43.671076114569495,"d":"43.67"},{"v":48.67738248601067,"d":"48.68"},{"v":54.17465299335625,"d":"54.17"},{"v":60.21948031212301,"d":"60.22"},{"v":66.87588779003924,"d":"66.88"},{"v":74.21660073695517,"d":"74.22"},{"v":82.32459796022836,"d":"82.32"},{"v":91.29501807672453,"d":"91.30"},{"v":101.2375185388056,"d":"101.24"},{"v":112.27921733668367,"d":"112.28"},{"v":124.56839166275542,"d":"124.57"},{"v":138.27916992868902,"d":"138.28"}]
[9,282.15,1148.1089552953367,{"v":0.7083876345012499,"d":"0.71"},{"v":1.4183907075022681,"d":"1.42"},{"v":2.1300147511871033,"d":"2.13"},{"v":2.843265323029148,"d":"2.84"},{"v":3.5581480059358137,"d":"3.56"},{"v":4.274668408394196,"d":"4.27"},{"v":4.992832164617741,"d":"4.99"},{"v":5.712644934693933,"d":"5.71"},{"v":6.4341124047329785,"d":"6.43"},{"v":7.157240287017539,"d":"7.16"},{"v":-3.132354593140027,"d":"-3.13"},{"v":-1.87130460182088,"d":"-1.87"},{"v":-0.5319760906350198,"d":"-0.53"},{"v":0.8555556474543208,"d":"0.86"},{"v":2.289005445268593,"d":"2.29"},{"v":3.8099136673672405,"d":"3.81"},{"v":5.428787374321384,"d":"5.43"},{"v":7.157240287017539,"d":"7.16"},{"v":9.008103681256728,"d":"9.01"},{"v":10.995550668007269,"d":"11.00"},{"v":13.13523615236507,"d":"13.14"},{"v":15.44445523626613,"d":"15.44"},{"v":17.942323406110436,"d":"17.94"},{"v":20.649982552442363,"d":"20.65"},{"v":23.590837737849032,"d":"23.59"},{"v":26.790830704214343,"d":"26.79"},{"v":30.278757447384393,"d":"30.28"},{"v":34.08663885954054,"d":"34.09"},{"v":38.250155544129626,"d":"38.25"},{"v":42.80916057405851,"d":"42.81"},{"v":47.80828736385352,"d":"47.81"},{"v":53.29767419419049,"d":"53.30"},{"v":59.33383258060433,"d":"59.33"},{"v":65.98069405445847,"d":"65.98"},{"v":73.31087962968894,"d":"73.31"},{"v":81.40724911312114,"d":"81.41"},{"v":90.36480468261432,"d":"90.36"},{"v":100.29304652995265,"d":"100.29"},{"v":111.31891034448172,"d":"111.32"},{"v":123.59046067316063,"d":"123.59"},{"v":137.28157620879185,"d":"137.28"}]
[11,284.15,1312.7393763438904,{"v":0.8100975362149252,"d":"0.81"},{"v":1.6223080467242537,"d":"1.62"},{"v":2.4366398092174313,"d":"2.44"},{"v":3.2531011446781597,"d":"3.25"},{"v":4.071700417667815,"d":"4.07"},{"v":4.892446036611098,"d":"4.89"},{"v":5.715346454083929,"d":"5.72"},{"v":6.540410167103626,"d":"6.54"},{"v":7.367645717421352,"d":"7.37"},{"v":8.1970616918169,"d":"8.20"},{"v":-3.9260107930875705,"d":"-3.93"},{"v":-2.666766693209487,"d":"-2.67"},{"v":-1.3293561725170828,"d":"-1.33"},{"v":0.056188545464198124,"d":"0.06"},{"v":1.487585566038165,"d":"1.49"},{"v":3.0063157657270443,"d":"3.01"},{"v":4.622871158425864,"d":"4.62"},{"v":6.348848833547928,"d":"6.35"},{"v":8.197061691816899,"d":"8.20"},{"v":10.181662547543574,"d":"10.18"},{"v":12.318283887157417,"d":"12.32"},{"v":14.624196045077852,"d":"14.62"},{"v":17.118487133299798,"d":"17.12"},{"v":19.82226876604278,"d":"19.82"},{"v":22.75891248858494,"d":"22.76"},{"v":25.954322892839944,"d":"25.95"},{"v":29.437254737238405,"d":"29.44"},{"v":33.23968305832114,"d":"33.24"},{"v":37.397237362990964,"d":"37.40"},{"v":41.949713652409955,"d":"41.95"},{"v":46.94168142365326,"d":"46.94"},{"v":52.42320715668098,"d":"52.42"},{"v":58.45072143949705,"d":"58.45"},{"v":65.08806425007202,"d":"65.09"},{"v":72.40775260514243,"d":"72.41"},{"v":80.49252765183186,"d":"80.49"},{"v":89.43725551976908,"d":"89.44"},{"v":99.3512795905717,"d":"99.35"},{"v":110.36135377484817,"d":"110.36"},{"v":122.61533058315938,"d":"122.62"},{"v":136.2868397046638,"d":"136.29"}]
[13,286.15,1497.810843290361,{"v":0.9244757467752759,"d":"0.92"},{"v":1.8517037608535545,"d":"1.85"},{"v":2.781696351267143,"d":"2.78"},{"v":3.714465900557917,"d":"3.71"},{"v":4.650024865326887,"d":"4.65"},{"v":5.5883857767887095,"d":"5.59"},{"v":6.529561241331184,"d":"6.53"},{"v":7.473563941079788,"d":"7.47"},{"v":8.420406634467314,"d":"8.42"},{"v":9.370102156808654,"d":"9.37"},{"v":-4.717397126840247,"d":"-4.72"},{"v":-3.459953753532175,"d":"-3.46"},{"v":-2.124455737857546,"d":"-2.12"},{"v":-0.7408923570831235,"d":"-0.74"},{"v":0.6884577572179215,"d":"0.69"},{"v":2.2050161636670937,"d":"2.21"},{"v":3.819259872517001,"d":"3.82"},{"v":5.542769389273952,"d":"5.54"},{"v":7.388339292137182,"d":"7.39"},{"v":9.370102156808654,"d":"9.37"},{"v":11.503668115169042,"d":"11.50"},{"v":13.806282804956586,"d":"13.81"},{"v":16.29700704205226,"d":"16.30"},{"v":18.996922250941395,"d":"19.00"},{"v":21.92936655545305,"d":"21.93"},{"v":25.12020750378002,"d":"25.12"},{"v":28.598158734876943,"d":"28.60"},{"v":32.395149560791744,"d":"32.40"},{"v":36.546758538019965,"d":"36.55"},{"v":41.09272475920478,"d":"41.09"},{"v":46.077553986774795,"d":"46.08"},{"v":51.551241105325296,"d":"51.55"},{"v":57.57013600678295,"d":"57.57"},{"v":64.19798737756923,"d":"64.20"},{"v":71.5072085346544,"d":"71.51"},{"v":79.58042230482839,"d":"79.58"},{"v":88.51235915858904,"d":"88.51"},{"v":98.41220611586638,"d":"98.41"},{"v":109.40653582842101,"d":"109.41"},{"v":121.64298937684231,"d":"121.64"},{"v":135.2949481587981,"d":"135.29"}]
[15,288.15,1705.4477944415173,{"v":1.0528499381107626,"d":"1.05"},{"v":2.109270320812551,"d":"2.11"},{"v":3.169279341192412,"d":"3.17"},{"v":4.232895316150752,"d":"4.23"},{"v":5.300136687456395,"d":"5.30"},{"v":6.371022022812461,"d":"6.37"},{"v":7.4455700169331624,"d":"7.45"},{"v":8.523799492631689,"d":"8.52"},{"v":9.605729401919264,"d":"9.61"},{"v":10.691378827115578,"d":"10.69"},{"v":-5.506523318259454,"d":"-5.51"},{"v":-4.250875528776086,"d":"-4.25"},{"v":-2.917284556142737,"d":"-2.92"},{"v":-1.5356968540189069,"d":"-1.54"},{"v":-0.10838780017399029,"d":"-0.11"},{"v":1.406005015520445,"d":"1.41"},{"v":3.0179436425239095,"d":"3.02"},{"v":4.738992049798154,"d":"4.74"},{"v":6.581926545345804,"d":"6.58"},{"v":8.56085952405999,"d":"8.56"},{"v":10.691378827115578,"d":"10.69"},{"v":12.990705466101574,"d":"12.99"},{"v":15.477873038740729,"d":"15.48"},{"v":18.173932866003888,"d":"18.17"},{"v":21.102189745720278,"d":"21.10"},{"v":24.28847428815602,"d":"24.29"},{"v":27.761459130224036,"d":"27.76"},{"v":31.553027990065225,"d":"31.55"},{"v":35.698708619278534,"d":"35.70"},{"v":40.23818336451486,"d":"40.24"},{"v":45.21589443557784,"d":"45.22"},{"v":50.681765326169135,"d":"50.68"},{"v":56.69206546260034,"d":"56.69"},{"v":63.3104525004659,"d":"63.31"},{"v":70.60923635312889,"d":"70.61"},{"v":78.67092186495995,"d":"78.67"},{"v":87.59010423475867,"d":"87.59"},{"v":97.4758145673252,"d":"97.48"},{"v":108.45444477323454,"d":"108.45"},{"v":120.67342510693324,"d":"120.67"},{"v":134.30588938370116,"d":"134.31"}]
[17,290.15,1937.9487912558297,{"v":1.1966594539781827,"d":"1.20"},{"v":2.397932414006756,"d":"2.40"},{"v":3.6038456114332442,"d":"3.60"},{"v":4.814425984518728,"d":"4.81"},{"v":6.0297006804437405,"d":"6.03"},{"v":7.249697057337543,"d":"7.25"},{"v":8.474442686331098,"d":"8.47"},{"v":9.703965353634075,"d":"9.70"},{"v":10.93829306263618,"d":"10.94"},{"v":12.177454036033211,"d":"12.18"},{"v":-6.293399035744481,"d":"-6.29"},{"v":-5.039541709340065,"d":"-5.04"},{"v":-3.707852341136654,"d":"-3.71"},{"v":-2.328234683313228,"d":"-2.33"},{"v":-0.9029608691147837,"d":"-0.90"},{"v":0.6092725317769978,"d":"0.61"},{"v":2.21891265069455,"d":"2.22"},{"v":3.937506967214904,"d":"3.94"},{"v":5.777813571248039,"d":"5.78"},{"v":7.753924734431006,"d":"7.75"},{"v":9.881406070802733,"d":"9.88"},{"v":12.17745403603321,"d":"12.18"},{"v":14.66107508730923,"d":"14.66"},{"v":17.35329052793802,"d":"17.35"},{"v":20.27737192478993,"d":"20.28"},{"v":23.45911305554602,"d":"23.46"},{"v":26.927145672009402,"d":"26.93"},{"v":30.71330802844119,"d":"30.71"},{"v":34.85307721643198,"d":"34.85"},{"v":39.38607899847173,"d":"39.39"},{"v":44.35669221298204,"d":"44.36"},{"v":49.814769166367476,"d":"49.81"},{"v":55.816499048800836,"d":"55.82"},{"v":62.42544874465635,"d":"62.43"},{"v":69.71382505858206,"d":"69.71"},{"v":77.76401518899809,"d":"77.76"},{"v":86.67047944878115,"d":"86.67"},{"v":96.54209347224898,"d":"96.54"},{"v":107.50506894423867,"d":"107.51"},{"v":119.70662589429975,"d":"119.71"},{"v":133.3196512613932,"d":"133.32"}]
[19,292.15,2197.7963700849855,{"v":1.3574623116254656,"d":"1.36"},{"v":2.7208628669194486,"d":"2.72"},{"v":4.090240716729305,"d":"4.09"},{"v":5.4656352550608345,"d":"5.47"},{"v":6.847086222855948,"d":"6.85"},{"v":8.234633711820356,"d":"8.23"},{"v":9.628318168302037,"d":"9.63"},{"v":11.028180397221293,"d":"11.03"},{"v":12.434261566053163,"d":"12.43"},{"v":13.846603208863057,"d":"13.85"},{"v":-7.078033892627394,"d":"-7.08"},{"v":-5.825961930430424,"d":"-5.83"},{"v":-4.496168751277683,"d":"-4.50"},{"v":-3.11851552747268,"d":"-3.12"},{"v":-1.6952711569757608,"d":"-1.70"},{"v":-0.18519102131631698,"d":"-0.19"},{"v":1.4221571351947726,"d":"1.42"},{"v":3.1383043497082053,"d":"3.14"},{"v":4.975990545922699,"d":"4.98"},{"v":6.949287929526134,"d":"6.95"},{"v":9.073739950719823,"d":"9.07"},{"v":11.366518579184959,"d":"11.37"},{"v":13.846603208863057,"d":"13.85"},{"v":16.534985210881878,"d":"16.53"},{"v":19.454903015787817,"d":"19.45"},{"v":22.63211367356857,"d":"22.63"},{"v":26.095208167349803,"d":"26.10"},{"v":29.875979416984663,"d":"29.88"},{"v":34.00985399832469,"d":"34.01"},{"v":38.53640125083901,"d":"38.54"},{"v":43.49993682203587,"d":"43.50"},{"v":48.95024203374953,"d":"48.95"},{"v":54.94342606851011,"d":"54.94"},{"v":61.54296529796939,"d":"61.54"},{"v":68.82096371169284,"d":"68.82"},{"v":76.85969119718163,"d":"76.86"},{"v":85.75347356551703,"d":"85.75"},{"v":95.61103142328236,"d":"95.61"},{"v":106.55839674282278,"d":"106.56"},{"v":118.7425799274681,"d":"118.74"},{"v":132.33622174291364,"d":"132.34"}]
[21,294.15,2487.6671127507157,{"v":1.5369425141909434,"d":"1.54"},{"v":3.081499562103965,"d":"3.08"},{"v":4.633727871732148,"d":"4.63"},{"v":6.193684735966655,"d":"6.19"},{"v":7.761428019645841,"d":"7.76"},{"v":9.33701616671022,"d":"9.34"},{"v":10.92050820746507,"d":"10.92"},{"v":12.511963765952649,"d":"12.51"},{"v":14.111443067435872,"d":"14.11"},{"v":15.719006945995526,"d":"15.72"},{"v":-7.860437447564508,"d":"-7.86"},{"v":-6.610145772453323,"d":"-6.61"},{"v":-5.282243390071921,"d":"-5.28"},{"v":-3.9065490139346877,"d":"-3.91"},{"v":-2.4853283159176343,"d":"-2.49"},{"v":-0.9773953221519324,"d":"-0.98"},{"v":0.6276673897107732,"d":"0.63"},{"v":2.341374461152924,"d":"2.34"},{"v":4.176447701322062,"d":"4.18"},{"v":6.146939307019348,"d":"6.15"},{"v":8.268370627636802,"d":"8.27"},{"v":10.557889216498738,"d":"10.56"},{"v":13.03444748126238,"d":"13.03"},{"v":15.719006945995526,"d":"15.72"},{"v":18.63477299915191,"d":"18.63"},{"v":21.807466067470042,"d":"21.81"},{"v":25.265636481333924,"d":"25.27"},{"v":29.041031955108256,"d":"29.04"},{"v":33.16902869255942,"d":"33.17"},{"v":37.68913977058846,"d":"37.69"},{"v":42.64561782548911,"d":"42.65"},{"v":48.088173396387425,"d":"48.09"},{"v":54.07283588569219,"d":"54.07"},{"v":60.66299140972794,"d":"60.66"},{"v":67.93064143535749,"d":"67.93"},{"v":75.95793887276547,"d":"75.96"},{"v":84.83907541372658,"d":"84.84"},{"v":94.6826170779492,"d":"94.68"},{"v":105.61441663634317,"d":"105.61"},{"v":117.78127546214223,"d":"117.78"},{"v":131.35558884783015,"d":"131.36"}]
[23,296.15,2810.44191989796,{"v":1.7369176928893924,"d":"1.74"},{"v":3.483563452589785,"d":"3.48"},{"v":5.240019235526167,"d":"5.24"},{"v":7.006367921331452,"d":"7.01"},{"v":8.78269332588268,"d":"8.78"},{"v":10.569080214558728,"d":"10.57"},{"v":12.365614315723931,"d":"12.37"},{"v":14.172382334442192,"d":"14.17"},{"v":15.989471966426015,"d":"15.99"},{"v":17.81697191222541,"d":"17.82"},{"v":-8.640619204924562,"d":"-8.64"},{"v":-7.392102761403809,"d":"-7.39"},{"v":-6.066085806483168,"d":"-6.07"},{"v":-4.692344715458454,"d":"-4.69"},{"v":-3.2731419432824826,"d":"-3.27"},{"v":-1.767349994154667,"d":"-1.77"},{"v":-0.16456623694506023,"d":"-0.16"},{"v":1.546707620719431,"d":"1.55"},{"v":3.379175324875209,"d":"3.38"},{"v":5.346869120256109,"d":"5.35"},{"v":7.465288318204697,"d":"7.47"},{"v":9.75155612502374,"d":"9.75"},{"v":12.224598038719327,"d":"12.22"},{"v":14.905345821056228,"d":"14.91"},{"v":17.81697191222541,"d":"17.82"},{"v":20.985160219715528,"d":"20.99"},{"v":24.438420536610842,"d":"24.44"},{"v":28.208455500157967,"d":"28.21"},{"v":32.33059108508016,"d":"32.33"},{"v":36.84428426547961,"d":"36.84"},{"v":41.793724845369034,"d":"41.79"},{"v":47.22855278216846,"d":"47.23"},{"v":53.20471792471759,"d":"53.20"},{"v":59.78551639031247,"d":"59.79"},{"v":67.04284741424783,"d":"67.04"},{"v":75.05874726157315,"d":"75.06"},{"v":83.92727388561622,"d":"83.93"},{"v":93.75683915819205,"d":"93.76"},{"v":104.67311715765487,"d":"104.67"},{"v":116.82270082072682,"d":"116.82"},{"v":130.37774066375235,"d":"130.38"}]
[25,298.15,3169.2164701436277,{"v":1.959347101530374,"d":"1.96"},{"v":3.93107779398253,"d":"3.93"},{"v":5.915309850881934,"d":"5.92"},{"v":7.912162543942539,"d":"7.91"},{"v":9.92175666696573,"d":"9.92"},{"v":11.944214560198203,"d":"11.94"},{"v":13.979660135159095,"d":"13.98"},{"v":16.028218899947,"d":"16.03"},{"v":18.090017985037598,"d":"18.09"},{"v":20.1651861695832,"d":"20.17"},{"v":-9.418588615173555,"d":"-9.42"},{"v":-8.171842369251548,"d":"-8.17"},{"v":-6.847705495319574,"d":"-6.85"},{"v":-5.475912150512582,"d":"-5.48"},{"v":-4.058721581982369,"d":"-4.06"},{"v":-2.5550646061713973,"d":"-2.56"},{"v":-0.9545533412249464,"d":"-0.95"},{"v":0.7542942024816012,"d":"0.75"},{"v":2.5841637590947397,"d":"2.58"},{"v":4.549067677858692,"d":"4.55"},{"v":6.664483294559464,"d":"6.66"},{"v":8.947509537518675,"d":"8.95"},{"v":11.417045071398485,"d":"11.42"},{"v":14.093991980057059,"d":"14.09"},{"v":17.00148984885337,"d":"17.00"},{"$f":"1000*(AC$19-$E$2*$A37)/($E$4+$E$3*$A37)","v":{"v":20.165186169583205,"d":"20.17"}},{"v":23.613550312981932,"d":"23.61"},{"v":27.378239967002457,"d":"27.38"},{"v":31.494531019758487,"d":"31.49"},{"v":36.00182450164304,"d":"36.00"},{"v":40.94424756256014,"d":"40.94"},{"v":46.37136977837107,"d":"46.37"},{"v":52.339061669935035,"d":"52.34"},{"v":58.91052961072819,"d":"58.91"},{"v":66.15757089437334,"d":"66.16"},{"v":74.16210547155329,"d":"74.16"},{"v":83.01805793638863,"d":"83.02"},{"v":92.83368644991532,"d":"92.83"},{"v":103.73448690464721,"d":"103.73"},{"v":115.86684439185439,"d":"115.87"},{"v":129.4026653458492,"d":"129.40"}]
[27,300.15,3567.3118472007463,{"v":2.206339989942287,"d":"2.21"},{"v":4.428388734435839,"d":"4.43"},{"v":6.666314598218725,"d":"6.67"},{"v":8.920288360675814,"d":"8.92"},{"v":11.19048325928238,"d":"11.19"},{"v":13.477075033989092,"d":"13.48"},{"v":15.780241972572165,"d":"15.78"},{"v":18.10016495697335,"d":"18.10"},{"v":20.437027510655014,"d":"20.44"},{"v":22.791015846996306,"d":"22.79"},{"$f":"1000*(N$19-$E$2*$A38)/($E$4+$E$3*$A38)","v":{"v":-10.194355075256356,"d":"-10.19"}},{"v":-8.949374014323292,"d":"-8.95"},{"v":-7.627111897617027,"d":"-7.63"},{"v":-6.257260783659418,"d":"-6.26"},{"v":-4.8420767208846645,"d":"-4.84"},{"v":-3.340548672857434,"d":"-3.34"},{"v":-1.7423034652331977,"d":"-1.74"},{"v":-0.03587536497186322,"d":"-0.04"},{"v":1.7914034011868267,"d":"1.79"},{"v":3.7535253433348803,"d":"3.75"},{"v":5.865945883929199,"d":"5.87"},{"v":8.145739742057403,"d":"8.15"},{"v":10.611778825020822,"d":"10.61"},{"v":13.28493562280895,"d":"13.28"},{"v":16.18831695898271,"d":"16.19"},{"v":19.34753401276212,"d":"19.35"},{"$f":"1000*(AD$19-$E$2*$A38)/($E$4+$E$3*$A38)","v":{"v":22.791015846996302,"d":"22.79"}},{"v":26.55037532762586,"d":"26.55"},{"v":30.660838397983547,"d":"30.66"},{"v":35.161750303167146,"d":"35.16"},{"v":40.09717571638756,"d":"40.10"},{"v":45.51661403124444,"d":"45.52"},{"v":51.47585666524691,"d":"51.48"},{"v":58.038020502175826,"d":"58.04"},{"v":65.27480118264694,"d":"65.27"},{"v":73.26800267233992,"d":"73.27"},{"v":82.11141658379692,"d":"82.11"},{"v":91.91314780253266,"d":"91.91"},{"v":102.79851453978351,"d":"102.80"},{"v":114.91369462991653,"d":"114.91"},{"v":128.430351116371,"d":"128.43"}]
[29,302.15,4008.2853164000253,{"$f":"0.62198*1000*$E$7*D$21*$C39/($E$6-$E$7*D$21*$C39)","v":{"v":2.4801643874872696,"d":"2.48"}},{"v":4.980187425567653,"d":"4.98"},{"v":7.5003085849757865,"d":"7.50"},{"v":10.040771202279384,"d":"10.04"},{"v":12.601822558204166,"d":"12.60"},{"v":15.183713957870856,"d":"15.18"},{"v":17.78670081299892,"d":"17.79"},{"v":20.411042726133505,"d":"20.41"},{"v":23.05700357695394,"d":"23.06"},{"v":25.724851610724027,"d":"25.72"},{"v":-10.967927928975037,"d":"-10.97"},{"v":-9.72470706168207,"d":"-9.72"},{"v":-8.404314401019272,"d":"-8.40"},{"v":-7.036400025936115,"d":"-7.04"},{"v":-5.623216795194093,"d":"-5.62"},{"v":-4.123811655059599,"d":"-4.12"},{"v":-2.527826097110405,"d":"-2.53"},{"v":-0.823810598922799,"d":"-0.82"},{"v":1.0008847026645804,"d":"1.00"},{"v":2.96023253468997,"d":"2.96"},{"v":5.069666468244681,"d":"5.07"},{"v":7.346237081637905,"d":"7.35"},{"v":9.80878960047094,"d":"9.81"},{"v":12.478167004546108,"d":"12.48"},{"v":15.377443448265623,"d":"15.38"},{"v":18.53219390095347,"d":"18.53"},{"v":21.970807231549646,"d":"21.97"},{"v":25.724851610724027,"d":"25.72"},{"v":29.829503178255422,"d":"29.83"},{"v":34.32405155168843,"d":"34.32"},{"v":39.25249910420388,"d":"39.25"},{"v":44.66427524559158,"d":"44.66"},{"v":50.61509251368826,"d":"50.62"},{"v":57.16797855562617,"d":"57.17"},{"v":64.39452764645449,"d":"64.39"},{"v":72.37642809481626,"d":"72.38"},{"v":81.20733890770244,"d":"81.21"},{"v":90.99521212851795,"d":"91.00"},{"v":101.86518878964453,"d":"101.87"},{"v":113.96324005459907,"d":"113.96"},{"v":127.46078626417514,"d":"127.46"}]
[31,304.15,4495.941231362429,{"v":2.7832563331105242,"d":"2.78"},{"v":5.591533843722484,"d":"5.59"},{"v":8.42517146188287,"d":"8.43"},{"v":11.284514266808987,"d":"11.28"},{"v":14.169913626978502,"d":"14.17"},{"v":17.08172734406687,"d":"17.08"},{"v":20.02031980085593,"d":"20.02"},{"v":22.986062113242138,"d":"22.99"},{"v":25.979332286477582,"d":"25.98"},{"v":29.000515375781973,"d":"29.00"},{"v":-11.73931646736402,"d":"-11.74"},{"v":-10.49785082350319,"d":"-10.50"},{"v":-9.179322340154814,"d":"-9.18"},{"v":-7.813339235232473,"d":"-7.81"},{"v":-6.4021511868315475,"d":"-6.40"},{"v":-4.904862960196073,"d":"-4.90"},{"v":-3.311130671414385,"d":"-3.31"},{"v":-1.6095209629056964,"d":"-1.61"},{"v":0.2125981689646836,"d":"0.21"},{"v":2.169179724042058,"d":"2.17"},{"v":4.27563548375322,"d":"4.28"},{"v":6.5489919537945465,"d":"6.55"},{"v":9.008067753407655,"d":"9.01"},{"v":11.673676435534759,"d":"11.67"},{"v":14.568859577666322,"d":"14.57"},{"v":17.719156041475127,"d":"17.72"},{"v":21.152914615486438,"d":"21.15"},{"v":24.901658901304145,"d":"24.90"},{"v":29.00051537578197,"d":"29.00"},{"v":33.48871818598524,"d":"33.49"},{"v":38.4102075809795,"d":"38.41"},{"v":43.81434318435601,"d":"43.81"},{"v":49.75675887700931,"d":"49.76"},{"v":56.300393321398026,"d":"56.30"},{"v":63.51673971322777,"d":"63.52"},{"v":71.48737103068244,"d":"71.49"},{"v":80.30581404963617,"d":"80.31"},{"v":90.07986840296003,"d":"90.08"},{"v":100.93449844447592,"d":"100.93"},{"v":113.015469250421,"d":"113.02"},{"v":126.49395914425567,"d":"126.49"}]
[33,306.15,5034.342051000531,{"v":3.1182295943407707,"d":"3.12"},{"v":6.26788254125557,"d":"6.27"},{"v":9.44943624028555,"d":"9.45"},{"v":12.663377810722906,"d":"12.66"},{"v":15.910204340241425,"d":"15.91"},{"v":19.190423141198217,"d":"19.19"},{"v":22.504552014884183,"d":"22.50"},{"v":25.853119524012364,"d":"25.85"},{"v":29.236665273745253,"d":"29.24"},{"v":32.655740201575,"d":"32.66"},{"v":-12.508529929062048,"d":"-12.51"},{"v":-11.268814559447076,"d":"-11.27"},{"v":-9.95214499701064,"d":"-9.95"},{"v":-8.588087716665598,"d":"-8.59"},{"v":-7.178889224809705,"d":"-7.18"},{"v":-5.683711942633033,"d":"-5.68"},{"v":-4.092226569497892,"d":"-4.09"},{"v":-2.3930158670865747,"d":"-2.39"},{"v":-0.573465640932727,"d":"-0.57"},{"v":1.3803574372405933,"d":"1.38"},{"v":3.483843420635764,"d":"3.48"},{"v":5.753994810213657,"d":"5.75"},{"v":8.2096036938779,"d":"8.21"},{"v":10.87145428068523,"d":"10.87"},{"v":13.762555663071153,"d":"13.76"},{"v":16.908410696869648,"d":"16.91"},{"v":20.33732820320559,"d":"20.34"},{"v":24.08078734028784,"d":"24.08"},{"v":28.173865062079102,"d":"28.17"},{"v":32.655740201575,"d":"32.66"},{"v":37.570291058896544,"d":"37.57"},{"v":42.96680766821191,"d":"42.97"},{"v":48.90084547526165,"d":"48.90"},{"v":55.43525440873998,"d":"55.44"},{"v":62.641426870021384,"d":"62.64"},{"v":70.60082083202677,"d":"70.60"},{"v":79.40683121236425,"d":"79.41"},{"v":89.16710566312148,"d":"89.17"},{"v":100.00643235773937,"d":"100.01"},{"v":112.07037086627766,"d":"112.07"},{"v":125.52985817727738,"d":"125.53"}]
[35,308.15,5627.81944654024,{"v":3.487885924419669,"d":"3.49"},{"v":7.015110582332967,"d":"7.02"},{"v":10.582343281405867,"d":"10.58"},{"v":14.19026859933805,"d":"14.19"},{"v":17.839586821836903,"d":"17.84"},{"v":21.531014395752905,"d":"21.53"},{"v":25.265284397992083,"d":"25.27"},{"v":29.043147020850334,"d":"29.04"},{"v":32.86537007444435,"d":"32.87"},{"v":36.732739506946075,"d":"36.73"},{"v":-13.275577500681022,"d":"-13.28"},{"v":-12.037607477028908,"d":"-12.04"},{"v":-10.722791601302777,"d":"-10.72"},{"v":-9.360654722951377,"d":"-9.36"},{"v":-7.953440185605452,"d":"-7.95"},{"v":-6.4603679040580895,"d":"-6.46"},{"v":-4.871123119883147,"d":"-4.87"},{"v":-3.17430466863866,"d":"-3.17"},{"v":-1.357316114880969,"d":"-1.36"},{"v":0.5937562534881432,"d":"0.59"},{"v":2.694280822627244,"d":"2.69"},{"v":4.961236156352329,"d":"4.96"},{"v":7.413387885933863,"d":"7.41"},{"v":10.071490959167285,"d":"10.07"},{"v":12.95852207490198,"d":"12.96"},{"v":16.0999481845155,"d":"16.10"},{"v":19.524038254269353,"d":"19.52"},{"v":23.262227124117558,"d":"23.26"},{"v":27.3495423645744,"d":"27.35"},{"v":31.825107650314774,"d":"31.83"},{"v":36.73273950694607,"d":"36.73"},{"v":42.12165857515771,"d":"42.12"},{"v":48.04734208638776,"d":"48.05"},{"v":54.572551485415495,"d":"54.57"},{"v":61.768578663092924,"d":"61.77"},{"v":69.71676691090063,"d":"69.72"},{"v":78.51037965945673,"d":"78.51"},{"v":88.25691300800086,"d":"88.26"},{"v":99.08097944566765,"d":"99.08"},{"v":111.12793361498736,"d":"111.13"},{"v":124.56847184911335,"d":"124.57"}]
[37,310.15,6280.9854778690415,{"v":3.895225914380394,"d":"3.90"},{"v":7.8395479578363085,"d":"7.84"},{"v":11.833900241904676,"d":"11.83"},{"v":15.879240726127133,"d":"15.88"},{"v":19.976551983992483,"d":"19.98"},{"v":24.1268419985904,"d":"24.13"},{"v":28.33114498932964,"d":"28.33"},{"v":32.5905222711451,"d":"32.59"},{"v":36.90606314769298,"d":"36.91"},{"v":41.27888584011319,"d":"41.28"},{"v":-14.040468317171712,"d":"-14.04"},{"v":-12.804238731985192,"d":"-12.80"},{"v":-11.491271330843725,"d":"-11.49"},{"v":-10.13104945477283,"d":"-10.13"},{"v":-8.725813293529194,"d":"-8.73"},{"v":-7.234840093850597,"d":"-7.23"},{"v":-5.647829598633208,"d":"-5.65"},{"v":-3.9533966721148914,"d":"-3.95"},{"v":-2.1389625879405436,"d":"-2.14"},{"v":-0.19063319503464693,"d":"-0.19"},{"v":1.9069382866401254,"d":"1.91"},{"v":4.170706551060441,"d":"4.17"},{"v":6.619410847253359,"d":"6.62"},{"v":9.273776944028716,"d":"9.27"},{"v":12.156749237732827,"d":"12.16"},{"v":15.2937588762416,"d":"15.29"},{"v":18.713035083015566,"d":"18.71"},{"v":22.44596850436627,"d":"22.45"},{"v":26.5275374662141,"d":"26.53"},{"v":30.996810640005254,"d":"31.00"},{"v":35.89754295052874,"d":"35.90"},{"v":41.27888584011318,"d":"41.28"},{"v":47.19623854581413,"d":"47.20"},{"v":53.712274277291634,"d":"53.71"},{"v":60.89818469748687,"d":"60.90"},{"v":68.835198738897,"d":"68.84"},{"v":77.61644871486027,"d":"77.62"},{"v":87.34927959789883,"d":"87.35"},{"v":98.15812868682343,"d":"98.16"},{"v":110.18814627284226,"d":"110.19"},{"v":123.60978871038668,"d":"123.61"}]
[39,312.15,6998.743818221726,{"v":4.343460505511839,"d":"4.34"},{"v":8.748010820180312,"d":"8.75"},{"v":13.214948893627476,"d":"13.21"},{"v":17.745609707063885,"d":"17.75"},{"v":22.341366603454006,"d":"22.34"},{"v":27.00363267543161,"d":"27.00"},{"v":31.733862213911458,"d":"31.73"},{"v":36.533552220516924,"d":"36.53"},{"v":41.40424398712757,"d":"41.40"},{"v":46.34752474604771,"d":"46.35"},{"v":-14.803211462186386,"d":"-14.80"},{"v":-13.568717428637218,"d":"-13.57"},{"v":-12.257593311906788,"d":"-12.26"},{"v":-10.899281061145352,"d":"-10.90"},{"v":-9.496017721091027,"d":"-9.50"},{"v":-8.007137709448822,"d":"-8.01"},{"v":-6.422355229720199,"d":"-6.42"},{"v":-4.730301129817292,"d":"-4.73"},{"v":-2.9184143427497173,"d":"-2.92"},{"v":-0.9728202235409346,"d":"-0.97"},{"v":1.1218064623911197,"d":"1.12"},{"v":3.3823966062058655,"d":"3.38"},{"v":5.827663148763401,"d":"5.83"},{"v":8.478302761817137,"d":"8.48"},{"v":11.357227629909753,"d":"11.36"},{"v":14.489833197945098,"d":"14.49"},{"v":17.90430905817314,"d":"17.90"},{"v":21.6320017873505,"d":"21.63"},{"v":25.707840605073343,"d":"25.71"},{"v":30.17083933399804,"d":"30.17"},{"v":35.06469147105888,"d":"35.06"},{"v":40.438479454519836,"d":"40.44"},{"v":46.347524746047704,"d":"46.35"},{"v":52.854412567931135,"d":"52.85"},{"v":60.03023463662188,"d":"60.03"},{"v":67.95610584673247,"d":"67.96"},{"v":76.72502776247424,"d":"76.73"},{"v":86.44419465398768,"d":"86.44"},{"v":97.23786912166155,"d":"97.24"},{"v":109.25099767916257,"d":"109.25"},{"v":122.65379737601585,"d":"122.65"}]
[41,314.15,7786.301006020615,{"v":4.836023237357185,"d":"4.84"},{"v":9.747837932244073,"d":"9.75"},{"v":14.737239893033049,"d":"14.74"},{"v":19.80608211309937,"d":"19.81"},{"v":24.956277065307756,"d":"24.96"},{"v":30.189799107869284,"d":"30.19"},{"v":35.50868700792664,"d":"35.51"},{"v":40.915046589644156,"d":"40.92"},{"v":46.41105351402834,"d":"46.41"},{"v":51.998956198188075,"d":"52.00"},{"v":-15.563815968438414,"d":"-15.56"},{"v":-14.331052620251457,"d":"-14.33"},{"v":-13.02176661958736,"d":"-13.02"},{"v":-11.665358639778894,"d":"-11.67"},{"v":-10.26406258936385,"d":"-10.26"},{"v":-8.777269896714046,"d":"-8.78"},{"v":-7.1947091853904634,"d":"-7.19"},{"v":-5.505027242163234,"d":"-5.51"},{"v":-3.6956806098919843,"d":"-3.70"},{"v":-1.7528140950064337,"d":"-1.75"},{"v":0.3388760520310496,"d":"0.34"},{"v":2.5962969863028347,"d":"2.60"},{"v":5.038135414266949,"d":"5.04"},{"v":7.685058992204977,"d":"7.69"},{"v":10.55994778317393,"d":"10.56"},{"v":13.688161629212383,"d":"13.69"},{"v":17.09785060248082,"d":"17.10"},{"v":20.820317333746587,"d":"20.82"},{"v":24.890442073969787,"d":"24.89"},{"v":29.347183950806265,"d":"29.35"},{"v":34.23417520557181,"d":"34.23"},{"v":39.600429465944735,"d":"39.60"},{"v":45.50119063627579,"d":"45.50"},{"v":51.998956198188075,"d":"52.00"},{"v":59.16471820188167,"d":"59.16"},{"v":67.07947782383282,"d":"67.08"},{"v":75.83610624573058,"d":"75.84"},{"v":85.54164745788479,"d":"85.54"},{"v":96.32018985209538,"d":"96.32"},{"v":108.31647673585496,"d":"108.32"},{"v":121.70048652476412,"d":"121.70"}]
[43,316.15,8649.177702585983,{"v":5.376583317332139,"d":"5.38"},{"v":10.846930786422432,"d":"10.85"},{"v":16.413516762517997,"d":"16.41"},{"v":22.078903434961212,"d":"22.08"},{"v":27.845744759479807,"d":"27.85"},{"v":33.716790603641705,"d":"33.72"},{"v":39.69489111907881,"d":"39.69"},{"v":45.78300135508534,"d":"45.78"},{"v":51.98418612928143,"d":"51.98"},{"v":58.30162517220924,"d":"58.30"},{"v":-16.322290818058832,"d":"-16.32"},{"v":-15.091253309396947,"d":"-15.09"},{"v":-13.783800278161166,"d":"-13.78"},{"v":-12.429291237437097,"d":"-12.43"},{"v":-11.029956968343418,"d":"-11.03"},{"v":-9.545245750291592,"d":"-9.55"},{"v":-7.964900586526633,"d":"-7.96"},{"v":-6.277584158048619,"d":"-6.28"},{"v":-4.470770568260447,"d":"-4.47"},{"v":-2.5306240205350714,"d":"-2.53"},{"v":-0.44186219022218814,"d":"-0.44"},{"v":1.8123984081434148,"d":"1.81"},{"v":4.250818320072778,"d":"4.25"},{"v":6.894036267617608,"d":"6.89"},{"v":9.76490028228789,"d":"9.76"},{"v":12.888734702943259,"d":"12.89"},{"v":16.293650192309098,"d":"16.29"},{"v":20.010905558210176,"d":"20.01"},{"v":24.075332220080387,"d":"24.08"},{"v":28.525834763718468,"d":"28.53"},{"v":33.40598434633454,"d":"33.41"},{"v":38.764725977687654,"d":"38.76"},{"v":44.657226221969296,"d":"44.66"},{"v":51.14589506580676,"d":"51.15"},{"v":58.30162517220924,"d":"58.30"},{"v":66.20530431792209,"d":"66.21"},{"v":74.94967366717694,"d":"74.95"},{"v":84.6416273512295,"d":"84.64"},{"v":95.40508004106658,"d":"95.41"},{"v":107.38457240697439,"d":"107.38"},{"v":120.74984489879267,"d":"120.75"}]
[45,318.15,9593.219934428605,{"v":5.969059610368343,"d":"5.97"},{"v":12.05379792153896,"d":"12.05"},{"v":18.257610567889564,"d":"18.26"},{"v":24.584027397709203,"d":"24.58"},{"v":31.03671917045456,"d":"31.04"},{"v":37.619504659079524,"d":"37.62"},{"v":44.33635818631268,"d":"44.34"},{"v":51.19141762613395,"d":"51.19"},{"v":58.188992904300235,"d":"58.19"},{"v":65.33357503461497,"d":"65.33"},{"v":-17.078644942949886,"d":"-17.08"},{"v":-15.849328448299666,"d":"-15.85"},{"v":-14.543703261439477,"d":"-14.54"},{"v":-13.191087850293393,"d":"-13.19"},{"v":-11.793709877305373,"d":"-11.79"},{"v":-10.311074313968827,"d":"-10.31"},{"v":-8.73293850300666,"d":"-8.73"},{"v":-7.0479809752080245,"d":"-7.05"},{"v":-5.243693345419129,"d":"-5.24"},{"v":-3.3062591597215745,"d":"-3.31"},{"v":-1.2204174584475747,"d":"-1.22"},{"v":1.030691640432081,"d":"1.03"},{"v":3.465702594628456,"d":"3.47"},{"v":6.105225272864594,"d":"6.11"},{"v":8.972075764664886,"d":"8.97"},{"v":12.091543004978277,"d":"12.09"},{"v":15.491698357285335,"d":"15.49"},{"v":19.20375692899888,"d":"19.20"},{"v":23.26250144456141,"d":"23.26"},{"v":27.706782100415683,"d":"27.71"},{"v":32.580109140459655,"d":"32.58"},{"v":37.93135914839142,"d":"37.93"},{"v":43.815621564489284,"d":"43.82"},{"v":50.295219125024076,"d":"50.30"},{"v":57.44094538370449,"d":"57.44"},{"v":65.33357503461497,"d":"65.33"},{"v":74.06571958806357,"d":"74.07"},{"v":83.74412373526344,"d":"83.74"},{"v":94.49252891211839,"d":"94.49"},{"v":106.45527371828956,"d":"106.46"},{"v":119.8018613032173,"d":"119.80"}]
[47,320.15,10624.610298922886,{"v":6.617635660869415,"d":"6.62"},{"v":13.377604048853339,"d":"13.38"},{"v":20.284547041341202,"d":"20.28"},{"v":27.343310580636313,"d":"27.34"},{"v":34.55895601237572,"d":"34.56"},{"v":41.93677218843885,"d":"41.94"},{"v":49.482288395164645,"d":"49.48"},{"v":57.20128817329031,"d":"57.20"},{"v":65.09982410220357,"d":"65.10"},{"v":73.18423362793351,"d":"73.18"},{"v":-17.8328872251357,"d":"-17.83"},{"v":-16.605286939193956,"d":"-16.61"},{"v":-15.301484493121393,"d":"-15.30"},{"v":-13.950757424284168,"d":"-13.95"},{"v":-12.555330285159286,"d":"-12.56"},{"v":-11.074764581030172,"d":"-11.07"},{"v":-9.498831954059856,"d":"-9.50"},{"v":-7.816226740571823,"d":"-7.82"},{"v":-6.014458017961282,"d":"-6.01"},{"v":-4.079728621011024,"d":"-4.08"},{"v":-1.9967988953818743,"d":"-2.00"},{"v":0.2511675034233545,"d":"0.25"},{"v":2.6827790181564035,"d":"2.68"},{"v":5.318616744774038,"d":"5.32"},{"v":8.181464920001385,"d":"8.18"},{"v":11.296577173729194,"d":"11.30"},{"v":14.691985679922004,"d":"14.69"},{"v":18.398861967598137,"d":"18.40"},{"v":22.45194020217167,"d":"22.45"},{"v":26.890016342591807,"d":"26.89"},{"v":31.756539889522507,"d":"31.76"},{"v":37.10031919165571,"d":"37.10"},{"v":42.976366780696885,"d":"42.98"},{"v":49.44691838617518,"d":"49.45"},{"v":56.582668729225304,"d":"56.58"},{"v":64.46427973701284,"d":"64.46"},{"v":73.18423362793351,"d":"73.18"},{"v":82.84912607041464,"d":"82.85"},{"v":93.58252574897273,"d":"93.58"},{"v":105.52856975685232,"d":"105.53"},{"v":118.85652460566905,"d":"118.86"}]
[49,322.15,11749.879112340668,{"v":7.326775874928899,"d":"7.33"},{"v":14.828224695884733,"d":"14.83"},{"v":22.510668217159484,"d":"22.51"},{"v":30.380736980392633,"d":"30.38"},{"v":38.44538940111706,"d":"38.45"},{"v":46.71193228874242,"d":"46.71"},{"v":55.18804292716432,"d":"55.19"},{"v":63.88179285625085,"d":"63.88"},{"v":72.80167350905006,"d":"72.80"},{"v":81.95662387588486,"d":"81.96"},{"v":-18.585026497109908,"d":"-18.59"},{"v":-17.35913763467098,"d":"-17.36"},{"v":-16.057152847143133,"d":"-16.06"},{"v":-14.708308855458926,"d":"-14.71"},{"v":-13.314827110799747,"d":"-13.31"},{"v":-11.836325494609133,"d":"-11.84"},{"v":-10.262589908619942,"d":"-10.26"},{"v":-8.582330450620319,"d":"-8.58"},{"v":-6.783073611864667,"d":"-6.78"},{"v":-4.851041462055396,"d":"-4.85"},{"v":-2.7710155927775184,"d":"-2.77"},{"v":-0.5261831314375334,"d":"-0.53"},{"v":1.9020384222929898,"d":"1.90"},{"v":4.53420147182998,"d":"4.53"},{"v":7.393058489912622,"d":"7.39"},{"v":10.503827899812523,"d":"10.50"},{"v":13.894502795248062,"d":"13.89"},{"v":17.596211248350183,"d":"17.60"},{"v":21.643639000898872,"d":"21.64"},{"v":26.075527925577063,"d":"26.08"},{"v":30.93526694918156,"d":"30.94"},{"v":36.27159637565387,"d":"36.27"},{"v":42.13945204256639,"d":"42.14"},{"v":48.60098291530243,"d":"48.60"},{"v":55.7267851579919,"d":"55.73"},{"v":63.59740824530301,"d":"63.60"},{"v":72.30520546421626,"d":"72.31"},{"v":81.95662387588486,"d":"81.96"},{"v":92.67505989511069,"d":"92.68"},{"v":104.60444967057042,"d":"104.60"},{"v":117.91382373585854,"d":"117.91"}]
[51,324.15,12975.915479491436,{"v":8.101243008446552,"d":"8.10"},{"v":16.4163071909749,"d":"16.42"},{"v":24.95377103020418,"d":"24.95"},{"v":33.72267811922028,"d":"33.72"},{"v":42.73256911656663,"d":"42.73"},{"v":51.993516372466125,"d":"51.99"},{"v":61.51616149046897,"d":"61.52"},{"v":71.31175611901192,"d":"71.31"},{"v":81.39220630162895,"d":"81.39"},{"v":91.77012075335654,"d":"91.77"},{"v":-19.33507154218047,"d":"-19.34"},{"v":-18.1108893380243,"d":"-18.11"},{"v":-16.810717148024455,"d":"-16.81"},{"v":-15.463750990327565,"d":"-15.46"},{"v":-14.072209223454522,"d":"-14.07"},{"v":-12.595765948037412,"d":"-12.60"},{"v":-11.024221285675146,"d":"-11.02"},{"v":-9.346301051734935,"d":"-9.35"},{"v":-7.549549102843906,"d":"-7.55"},{"v":-5.620206690067136,"d":"-5.62"},{"v":-3.5430765917575147,"d":"-3.54"},{"v":-1.301369341870984,"d":"-1.30"},{"v":1.1234716897306347,"d":"1.12"},{"v":3.751970293812812,"d":"3.75"},{"v":6.606847267571182,"d":"6.61"},{"v":9.713285925686126,"d":"9.71"},{"v":13.099240390443367,"d":"13.10"},{"v":16.795795398086096,"d":"16.80"},{"v":20.837588401589084,"d":"20.84"},{"v":25.263307337964644,"d":"25.26"},{"v":30.116280728801918,"d":"30.12"},{"v":35.445181022753104,"d":"35.45"},{"v":41.30486757680163,"d":"41.30"},{"v":47.75740283376763,"d":"47.76"},{"v":54.873284675194455,"d":"54.87"},{"v":62.73295043636123,"d":"62.73"},{"v":71.42862483182482,"d":"71.43"},{"v":81.06660672924049,"d":"81.07"},{"v":91.77012075335654,"d":"91.77"},{"v":103.68290266778385,"d":"103.68"},{"v":116.97374768514369,"d":"116.97"}]
[53,326.15,14309.97826456951,{"v":8.946117126794174,"d":"8.95"},{"v":18.15333894578323,"d":"18.15"},{"v":27.63326579035172,"d":"27.63"},{"v":37.398195494665146,"d":"37.40"},{"v":47.461176617580236,"d":"47.46"},{"v":57.83606661568816,"d":"57.84"},{"v":68.5375955108483,"d":"68.54"},{"v":79.58143566734823,"d":"79.58"},{"v":90.98427837381041,"d":"90.98"},{"v":102.76391801684477,"d":"102.76"},{"v":-20.083031094811524,"d":"-20.08"},{"v":-18.86055080359253,"d":"-18.86"},{"v":-17.562186171212133,"d":"-17.56"},{"v":-16.217092626204703,"d":"-16.22"},{"v":-14.827485443029756,"d":"-14.83"},{"v":-13.353094785191061,"d":"-13.35"},{"v":-11.783734954615388,"d":"-11.78"},{"v":-10.108147440546444,"d":"-10.11"},{"v":-8.313893416699846,"d":"-8.31"},{"v":-6.38723326216976,"d":"-6.39"},{"v":-4.312990883167364,"d":"-4.31"},{"v":-2.074400155116376,"d":"-2.07"},{"v":0.34706975386292427,"d":"0.35"},{"v":2.9719141014427275,"d":"2.97"},{"v":5.822822097348634,"d":"5.82"},{"v":8.924942045288875,"d":"8.92"},{"v":12.306189204476174,"d":"12.31"},{"v":15.997605095760964,"d":"16.00"},{"v":20.03377901757931,"d":"20.03"},{"v":24.453345121240478,"d":"24.45"},{"v":29.299571691082004,"d":"29.30"},{"v":34.6210635091377,"d":"34.62"},{"v":40.4726036644555,"d":"40.47"},{"v":46.91616831786746,"d":"46.92"},{"v":54.02215734160408,"d":"54.02"},{"v":61.87089624335779,"d":"61.87"},{"v":70.5544815227561,"d":"70.55"},{"v":80.17906426600685,"d":"80.18"},{"v":90.86769778546517,"d":"90.87"},{"v":102.76391801684477,"d":"102.76"},{"v":116.0362855061012,"d":"116.04"}]
[55,328.15,15759.706943242292,{"v":9.866816224370709,"d":"9.87"},{"v":20.051724151341272,"d":"20.05"},{"v":30.570358009067256,"d":"30.57"},{"v":41.439393655555705,"d":"41.44"},{"v":52.676636796224216,"d":"52.68"},{"v":64.30112032150862,"d":"64.30"},{"v":76.33321188378783,"d":"76.33"},{"v":88.79473299268274,"d":"88.79"},{"v":101.7090910937034,"d":"101.71"},{"v":115.10142631210171,"d":"115.10"},{"v":-20.8289138409625,"d":"-20.83"},{"v":-19.608130737099188,"d":"-19.61"},{"v":-18.311568643420618,"d":"-18.31"},{"v":-16.968342511551217,"d":"-16.97"},{"v":-15.580664540452398,"d":"-15.58"},{"v":-14.108320800833816,"d":"-14.11"},{"v":-12.54113973557657,"d":"-12.54"},{"v":-10.867878464280329,"d":"-10.87"},{"v":-9.076115429666057,"d":"-9.08"},{"v":-7.1521300857455605,"d":"-7.15"},{"v":-5.080767407924078,"d":"-5.08"},{"v":-2.8452845482824953,"d":"-2.85"},{"v":-0.4271764015673459,"d":"-0.43"},{"v":2.194023836026105,"d":"2.19"},{"v":5.04097387446012,"d":"5.04"},{"v":8.138787103683278,"d":"8.14"},{"v":11.515340027743651,"d":"11.52"},{"v":15.201631072092043,"d":"15.20"},{"v":19.23220151433313,"d":"19.23"},{"v":23.645631869416082,"d":"23.65"},{"v":28.48513035168336,"d":"28.49"},{"v":33.79923426443551,"d":"33.80"},{"v":39.642650640552766,"d":"39.64"},{"v":46.077269598452204,"d":"46.08"},{"v":53.173393273187,"d":"53.17"},{"v":61.011235655366704,"d":"61.01"},{"v":69.68276538569478,"d":"69.68"},{"v":79.29398617926591,"d":"79.29"},{"v":89.96778051171314,"d":"89.97"},{"v":101.84748504570102,"d":"101.85"},{"v":115.1014263121017,"d":"115.10"}]
[]
["umidificazione","Temperatura di partenza",null,null,{"$f":"DESIGN!V51","v":19.001116320862707},null,"Temperatura di partenza",null,null,{"$f":"DESIGN!AC43-DESIGN!V27","v":-5},"riscaldamento",null,{"$f":"DESIGN!$C$35","v":"External Air"}]
[null,"Umidità specifica partenza",null,null,{"$f":"DESIGN!AC45","v":2.2379341661572782},null,"Umidità specifica partenza",null,null,{"$f":"DESIGN!AC45","v":2.2379341661572782},null,null,{"$f":"DESIGN!$E$37","v":-5}]
[{"$nulls":12},{"$f":"DESIGN!$W$45","v":2.2379341661572782}]
[null,"Temperatura arrivo",null,null,{"$f":"DESIGN!W60","v":19.905815399642382},null,"Temperatura arrivo",null,null,{"$f":"E54","v":19.001116320862707}]
[null,"Umidità specifica arrivo",null,null,{"$f":"DESIGN!W61","v":7.24860872948643},null,"Umidità specifica arrivo",null,null,{"$f":"E55","v":2.2379341661572782}]
[]
[null,null,"Isoterma",{"$nulls":4},"Riscaldamento"]
[null,null,"t","x",{"$nulls":3},"t","x"]
[null,1,{"$f":"E54","v":19.001116320862707},{"$f":"E55","v":2.2379341661572782},null,null,1,{"$f":"J54","v":-5},{"$f":"J55","v":2.2379341661572782}]
[null,{"$f":"B62+1","v":2},{"$f":"C62+((C$102-C$62)/40)","v":19.0237337978322},{"$f":"D62+((D$102-D$62)/40)","v":2.363201030240507},null,null,{"$f":"G62+1","v":2},{"$f":"H62+((H$102-H$62)/40)","v":-4.399972091978432},{"$f":"I62+((I$102-I$62)/40)","v":2.2379341661572782}]
[null,{"$f":"B63+1","v":3},19.046351274801694,2.488467894323736,null,null,{"$f":"G63+1","v":3},-3.7999441839568644,2.2379341661572782]
[null,4,19.068968751771187,2.613734758406965,null,null,4,-3.199916275935297,2.2379341661572782]
[null,5,19.09158622874068,2.7390016224901936,null,null,5,-2.5998883679137292,2.2379341661572782]
[null,6,19.114203705710175,2.8642684865734225,null,null,6,-1.9998604598921617,2.2379341661572782]
[null,7,19.136821182679668,2.9895353506566513,null,null,7,-1.399832551870594,2.2379341661572782]
[null,8,19.15943865964916,3.11480221473988,null,null,8,-0.7998046438490264,2.2379341661572782]
[null,9,19.182056136618655,3.240069078823109,null,null,9,-0.1997767358274587,2.2379341661572782]
[null,10,19.20467361358815,3.365335942906338,null,null,10,0.400251172194109,2.2379341661572782]
[null,11,19.227291090557642,3.4906028069895667,null,null,11,1.0002790802156767,2.2379341661572782]
[null,12,19.249908567527136,3.6158696710727956,null,null,12,1.6003069882372443,2.2379341661572782]
[null,13,19.27252604449663,3.7411365351560244,null,null,13,2.200334896258812,2.2379341661572782]
[null,14,19.295143521466123,3.8664033992392532,null,null,14,2.8003628042803794,2.2379341661572782]
[null,15,19.317760998435617,3.991670263322482,null,null,15,3.400390712301947,2.2379341661572782]
[null,16,19.34037847540511,4.116937127405711,null,null,16,4.000418620323515,2.2379341661572782]
[null,17,19.362995952374604,4.24220399148894,null,null,17,4.600446528345083,2.2379341661572782]
[null,18,19.385613429344097,4.367470855572169,null,null,18,5.200474436366651,2.2379341661572782]
[null,19,19.40823090631359,4.4927377196553975,null,null,19,5.800502344388219,2.2379341661572782]
[null,20,19.430848383283085,4.618004583738626,null,null,20,6.400530252409787,2.2379341661572782]
[null,21,19.453465860252578,4.743271447821855,null,null,21,7.000558160431355,2.2379341661572782]
[null,22,19.47608333722207,4.868538311905084,null,null,22,7.600586068452923,2.2379341661572782]
[null,23,19.498700814191565,4.993805175988313,null,null,23,8.200613976474491,2.2379341661572782]
[null,24,19.52131829116106,5.119072040071542,null,null,24,8.80064188449606,2.2379341661572782]
[null,25,19.543935768130552,5.2443389041547706,null,null,25,9.400669792517627,2.2379341661572782]
[null,26,19.566553245100046,5.369605768237999,null,null,26,10.000697700539195,2.2379341661572782]
[null,27,19.58917072206954,5.494872632321228,null,null,27,10.600725608560763,2.2379341661572782]
[null,28,19.611788199039033,5.620139496404457,null,null,28,11.200753516582331,2.2379341661572782]
[null,29,19.634405676008527,5.745406360487686,null,null,29,11.8007814246039,2.2379341661572782]
[null,30,19.65702315297802,5.870673224570915,null,null,30,12.400809332625467,2.2379341661572782]
[null,31,19.679640629947514,5.995940088654144,null,null,31,13.000837240647035,2.2379341661572782]
[null,32,19.702258106917007,6.1212069527373725,null,null,32,13.600865148668603,2.2379341661572782]
[null,33,19.7248755838865,6.246473816820601,null,null,33,14.200893056690171,2.2379341661572782]
[null,34,19.747493060855994,6.37174068090383,null,null,34,14.80092096471174,2.2379341661572782]
[null,35,19.770110537825488,6.497007544987059,null,null,35,15.400948872733307,2.2379341661572782]
[null,36,19.79272801479498,6.622274409070288,null,null,36,16.000976780754876,2.2379341661572782]
[null,37,19.815345491764475,6.747541273153517,null,null,37,16.60100468877644,2.2379341661572782]
[null,38,19.83796296873397,6.8728081372367456,null,null,38,17.201032596798008,2.2379341661572782]
[null,39,19.860580445703462,6.998075001319974,null,null,39,17.801060504819574,2.2379341661572782]
[null,40,19.883197922672956,7.123341865403203,null,null,40,18.40108841284114,2.2379341661572782]
[null,41,{"$f":"E57","v":19.905815399642382},{"$f":"E58","v":7.24860872948643},null,null,41,{"$f":"J57","v":19.001116320862707},{"$f":"J58","v":2.2379341661572782}]

{"sheet":"DESIGN","index":3,"n_rows":261,"n_cols":142,"rows_kept":261,"merged":[[45,1,46,10],[92,3,92,4],[92,6,93,9],[97,3,97,4],[97,6,98,9],[102,3,102,4],[102,6,103,9],[109,5,110,7],[114,6,114,9],[119,3,119,4],[119,6,119,9],[122,3,122,4],[122,6,122,9],[125,3,125,4],[125,6,125,9],[130,3,130,4],[130,6,130,9],[133,39,146,39],[133,51,146,51],[136,3,136,4],[136,6,136,9],[139,3,139,4],[139,6,139,9],[142,3,142,4],[142,6,142,9],[143,26,143,27],[145,3,145,4],[145,6,145,9],[147,39,158,39],[147,51,158,51],[154,3,154,9],[159,39,168,39],[159,51,169,51],[170,39,177,39],[170,51,177,51],[178,39,180,39],[178,51,180,51],[185,21,185,25],[185,36,185,41],[186,21,186,25],[186,36,186,41],[223,21,223,25],[223,36,223,41],[226,84,226,88],[226,107,226,111],[226,130,226,134]]}
{"$rows_empty":25}
[null,"Choose your language: ",null,null,"ENGLISH"]
[{"$nulls":20},"fattore",{"$f":"GRAFICI!E8","v":273.15}]
[null,{"$f":"LINGUA!B3","v":"INSTRUCTIONS: insert input data in grey cells. Results appear in green cells."},{"$nulls":18},"c.s. aria J/(°C*g)=",{"$f":"GRAFICI!E2","v":1.006},{"$nulls":4},{"$f":"E26","v":"ENGLISH"}]
[{"$nulls":20},"c.s. vapo J/(°C*g)=",{"$f":"GRAFICI!E3","v":1.805}]
[null,{"$f":"LINGUA!B53","v":"STEP 1"},{"$nulls":18},"c latente J/g=",{"$f":"GRAFICI!E4","v":2501}]
[{"$nulls":20},"R Joule/Kmole*°K=",{"$f":"GRAFICI!E5","v":8313.6}]
[{"$nulls":20},"f s",{"$f":"GRAFICI!E7","v":1.004}]
[null,null,{"$f":"LINGUA!B4","v":"Altitude a.s.l."},null,0,{"$f":"LINGUA!B8","v":"m"},{"$f":"IF(OR(E33<-300,E33>3000),LINGUA!B5,\"\")","v":""},{"$nulls":13},{"$f":"GRAFICI!A2","v":-5674.359},{"$f":"GRAFICI!B2","v":-5800.2206}]
[{"$nulls":20},{"$f":"GRAFICI!A3","v":6.3925247},{"$f":"GRAFICI!B3","v":1.3914993}]
[null,null,{"$f":"LINGUA!B6","v":"External Air"},{"$nulls":17},{"$f":"GRAFICI!A4","v":-0.009677843},{"$f":"GRAFICI!B4","v":-0.048640239}]
[null,null,{"$f":"LINGUA!B9","v":"Relative humidity"},null,{"v":0.9,"d":"90.0%"},{"$f":"LINGUA!K12","v":"rH"},null,{"$f":"LINGUA!B11","v":"Specific humidity"},null,{"$f":"IF(G33=\"\",W45,0)","v":{"v":2.2379341661572782,"d":"2.2"}},{"$f":"LINGUA!K4","v":"g/kg"},{"$nulls":9},{"$f":"GRAFICI!A5","v":6.2215701e-07},{"$f":"GRAFICI!B5","v":4.1764768e-05}]
[null,null,{"$f":"LINGUA!B10","v":"Temperature"},null,{"v":-5,"d":"-5.0"},{"$f":"LINGUA!K6","v":"°C"},{"$nulls":14},{"$f":"GRAFICI!A6","v":2.0747825e-09},{"$f":"GRAFICI!B6","v":-1.4452093e-08}]
[{"$nulls":20},{"$f":"GRAFICI!A7","v":-9.484024e-13},{"$f":"GRAFICI!B7","v":0}]
[{"$nulls":20},{"$f":"GRAFICI!A8","v":4.1635019},{"$f":"GRAFICI!B8","v":6.5459673}]
[null,null,{"$f":"LINGUA!B7","v":"Air after the humidifier"},null,{"$f":"IF(OR(J41<J36),LINGUA!B24,\"\")","v":""}]
[null,null,{"$f":"LINGUA!B9","v":"Relative humidity"},null,{"v":0.5,"d":"50.0%"},{"$f":"LINGUA!K12","v":"rH"},null,{"$f":"LINGUA!B11","v":"Specific humidity"},null,{"$f":"Z45","v":{"v":7.2911944456998,"d":"7.3"}},{"$f":"LINGUA!K4","v":"g/kg"},{"$nulls":9},"Condizioni dell'aria in ingresso",null,null,"Condizioni finali dell'aria",null,null,"Aria miscelata",null,null,"Condizioni dell'aria prima dell'umidificatore"]
[null,null,{"$f":"LINGUA!B10","v":"Temperature"},null,{"v":20,"d":"20.0"},{"$f":"LINGUA!K6","v":"°C"},{"$nulls":14},"pressione atm Pascal",null,{"$f":"101325*(1-0.0000225577*E33)^5.2559","v":101325},"pressione atm Pascal",null,{"$f":"W42","v":101325},"pressione atm Pascal",null,{"$f":"Z42","v":101325},"pressione atm Pascal",null,{"$f":"AC42","v":101325},null,null,"delt t"]
[null,null,{"$f":"LINGUA!B17","v":"Percentage of recirculation air"},null,{"v":0,"d":"0.0%"},null,null,{"$f":"IF(OR(AC45>AC46),LINGUA!C24,\"\")","v":""},{"$nulls":12},"T t OA °K",null,{"$f":"$V$27+E37","v":{"v":268.15,"d":"268.2"}},"T t OA °K",null,{"$f":"$V$27+E42","v":{"v":293.15,"d":"293.2"}},"T t OA °K",null,{"$f":"((W43*E77*(1-E43))+(Z43*E77*E43))/E77","v":{"v":268.15,"d":"268.150"}},"T t OA °K",null,{"$f":"+Z43-AI43","v":{"v":292.1511163208627,"d":"292.2"}},{"$f":"+AF43-V27","v":{"v":19.001116320862707,"d":"19.0"}},null,{"$f":"(100-(AC43-V27))*(1.9*(Z45-AC45)/1000)/(1.005+1.9*AC45/1000)","v":0.998883679137286}]
[{"$nulls":20},"Pvs t OA Pascal",null,{"$f":"IF(W43<$V$27,EXP($U$33/W43+$U$34+$U$35*W43+$U$36*(W43)^2+$U$37*(W43^3)+$U$38*(W43^4)+$U$39*LN(W43)),EXP($V$33/W43+$V$34+$V$35*W43+$V$36*(W43)^2+$V$37*(W43^3)+$V$38*(W43^4)+$V$39*LN(W43)))","v":402.02925588076624},"Pvs t OA Pascal",null,{"$f":"IF(Z43<$V$27,EXP($U$33/Z43+$U$34+$U$35*Z43+$U$36*(Z43)^2+$U$37*(Z43^3)+$U$38*(Z43^4)+$U$39*LN(Z43)),EXP($V$33/Z43+$V$34+$V$35*Z43+$V$36*(Z43)^2+$V$37*(Z43^3)+$V$38*(Z43^4)+$V$39*LN(Z43)))","v":2338.8037000739814},"Pvs t OA Pascal",null,{"$f":"IF(AC43<$V$27,EXP($U$33/AC43+$U$34+$U$35*AC43+$U$36*(AC43)^2+$U$37*(AC43^3)+$U$38*(AC43^4)+$U$39*LN(AC43)),EXP($V$33/AC43+$V$34+$V$35*AC43+$V$36*(AC43)^2+$V$37*(AC43^3)+$V$38*(AC43^4)+$V$39*LN(AC43)))","v":402.02925588076624},"Pvs t OA Pascal",null,{"$f":"IF(AF43<$V$27,EXP($U$33/AF43+$U$34+$U$35*AF43+$U$36*(AF43)^2+$U$37*(AF43^3)+$U$38*(AF43^4)+$U$39*LN(AF43)),EXP($V$33/AF43+$V$34+$V$35*AF43+$V$36*(AF43)^2+$V$37*(AF43^3)+$V$38*(AF43^4)+$V$39*LN(AF43)))","v":2197.949531962587}]
[{"$nulls":20},"x OA g/kg",null,{"$f":"$V$32*1000*0.62198*E36*W44/(W42-E36*W44)","v":2.2379341661572782},"x OA g/kg",null,{"$f":"$V$32*1000*0.62198*E41*Z44/(Z42-E41*Z44)","v":7.2911944456998},"x OA g/kg",null,{"$f":"((W45*E77*(1-E43))+(Z45*E77*E43))/E77","v":2.2379341661572782},"x OA g/kg",null,{"$f":"AC45","v":{"v":2.2379341661572782,"d":"2.2379"}},null,null,"delta x per il calcolo del carico finale"]
[null,{"$f":"LINGUA!B13","v":"The following diagram shows the isothermal transformation in red. Blue lines represent curves at a fixed relative humidity, while cyan ones are constant-enthalpy curves."},{"$nulls":24},"Limite di condensazione",null,{"$f":"621.98*V32*AC44/(101180.925-V32*AC44)","v":2.491180097324921},{"$nulls":5},{"$f":"+Z45-AC45","v":5.053260279542521}]
[{"$nulls":20},"Iterazione per il calcolo della temperatura di setpoint partendo dall'aria prima dell'umidificatore"]
[{"$nulls":20},"f2",{"$f":"E41","v":{"v":0.5,"d":"50.0%"}}]
[{"$nulls":20},"t1",{"$f":"AG43","v":{"v":19.001116320862707,"d":"19.0011"}}]
[{"$nulls":20},"x1",{"$f":"AF45","v":{"v":2.2379341661572782,"d":"2.2"}}]
[{"$nulls":20},"t",{"$f":"V49","v":{"v":19.001116320862707,"d":"19.0011"}},{"$f":"V51+(V56/V57)","v":19.27874337446579},19.471049638257583,19.604320360585792,19.696709861498324,19.760773659688002,19.80520341239855,19.83602000324914,19.8573961625665,19.872224711321433,19.882511603948828,19.88964803833808,19.894598963239098,19.89803372757976,19.9004166582126,19.902069870121252,19.903216828088052,19.904012561813545,19.904564625167612,19.904947635678983,19.905213360972542,19.9053977161742,19.905525618400194,19.905614354626056,19.905675918211234,19.905718629917583,19.905748262533283,19.905768821112076,19.905783084287105,19.905792979823737,19.90579984517086,19.90580460822654,19.905807912749864,19.9058102053694,19.905811795948082,19.905812899463307,19.90581366506256,null,{"$f":"BF51+(BF56/BF57)","v":19.90581419622172},19.90581456473051,19.90581482039536,19.90581499777109,19.90581512083122,19.905815206208153,19.905815265441152,19.905815306535956,19.905815335046796,19.905815354827116,19.905815368550346,19.905815378071278,19.905815384676735,19.905815389259487,19.905815392438917,19.905815394644748,19.90581539617511,19.90581539723685,19.90581539797347,19.90581539848452,19.905815398839078,19.905815399085064,19.905815399255726,19.905815399374127,19.905815399456273,19.905815399513262,19.9058153995528,19.905815399580234,{"$f":"CI51+(CI56/CI57)","v":19.905815399599266},19.905815399612468,19.90581539962163,19.905815399627986,19.905815399632395,19.90581539963545,19.90581539963757,19.905815399639046,19.90581539964007,19.905815399640776,19.90581539964127,19.905815399641607,19.90581539964185,19.905815399642012,19.905815399642126,19.9058153996422,19.905815399642258,19.905815399642293,19.905815399642318,19.905815399642343,19.90581539964236,19.90581539964237,19.90581539964237,19.90581539964237,19.90581539964237,19.90581539964237,19.90581539964237,19.90581539964237,19.90581539964237,19.90581539964237,19.90581539964237,19.90581539964237,19.90581539964237,19.90581539964237,19.90581539964237,19.90581539964237,19.90581539964237,19.90581539964237,19.90581539964237,19.90581539964237,19.90581539964237,19.90581539964237,19.90581539964237,19.90581539964237,19.90581539964237,19.90581539964237,19.90581539964237,19.90581539964237,19.90581539964237,19.90581539964237,19.90581539964237,19.90581539964237,19.90581539964237,19.90581539964237,19.90581539964237]
[{"$nulls":20},"T",{"$f":"V51+$V$27","v":{"v":292.1511163208627,"d":"292.1511"}},{"$f":"W51+$V$27","v":{"v":292.42874337446574,"d":"292.4287"}},{"v":292.62104963825755,"d":"292.6210"},{"v":292.7543203605858,"d":"292.7543"},{"v":292.8467098614983,"d":"292.8467"},{"v":292.910773659688,"d":"292.9108"},{"v":292.95520341239853,"d":"292.9552"},{"v":292.9860200032491,"d":"292.9860"},{"v":293.00739616256647,"d":"293.0074"},{"v":293.0222247113214,"d":"293.0222"},{"v":293.0325116039488,"d":"293.0325"},{"v":293.03964803833804,"d":"293.0396"},{"v":293.0445989632391,"d":"293.0446"},{"v":293.04803372757976,"d":"293.0480"},{"v":293.05041665821255,"d":"293.0504"},{"v":293.0520698701212,"d":"293.0521"},{"v":293.053216828088,"d":"293.0532"},{"v":293.0540125618135,"d":"293.0540"},{"v":293.0545646251676,"d":"293.0546"},{"v":293.05494763567896,"d":"293.0549"},{"v":293.0552133609725,"d":"293.0552"},{"v":293.0553977161742,"d":"293.0554"},{"v":293.05552561840017,"d":"293.0555"},{"v":293.055614354626,"d":"293.0556"},{"v":293.0556759182112,"d":"293.0557"},{"v":293.0557186299176,"d":"293.0557"},{"v":293.05574826253326,"d":"293.0557"},{"v":293.05576882111205,"d":"293.0558"},{"v":293.0557830842871,"d":"293.0558"},{"v":293.0557929798237,"d":"293.0558"},{"v":293.05579984517084,"d":"293.0558"},{"v":293.05580460822654,"d":"293.0558"},{"v":293.05580791274986,"d":"293.0558"},{"v":293.05581020536937,"d":"293.0558"},{"v":293.05581179594805,"d":"293.0558"},{"v":293.05581289946326,"d":"293.0558"},{"v":293.05581366506254,"d":"293.0558"},null,{"v":293.0558141962217,"d":"293.0558"},{"v":293.0558145647305,"d":"293.0558"},{"v":293.0558148203953,"d":"293.0558"},{"v":293.05581499777105,"d":"293.0558"},{"v":293.0558151208312,"d":"293.0558"},{"v":293.05581520620814,"d":"293.0558"},{"v":293.05581526544114,"d":"293.0558"},{"v":293.0558153065359,"d":"293.0558"},{"v":293.05581533504676,"d":"293.0558"},{"v":293.0558153548271,"d":"293.0558"},{"v":293.0558153685503,"d":"293.0558"},{"v":293.05581537807126,"d":"293.0558"},{"v":293.0558153846767,"d":"293.0558"},{"v":293.05581538925946,"d":"293.0558"},{"v":293.0558153924389,"d":"293.0558"},{"v":293.0558153946447,"d":"293.0558"},{"v":293.0558153961751,"d":"293.0558"},{"v":293.0558153972368,"d":"293.0558"},{"v":293.05581539797345,"d":"293.0558"},{"v":293.05581539848447,"d":"293.0558"},{"v":293.05581539883906,"d":"293.0558"},{"v":293.055815399085,"d":"293.0558"},{"v":293.0558153992557,"d":"293.0558"},{"v":293.0558153993741,"d":"293.0558"},{"v":293.05581539945626,"d":"293.0558"},{"v":293.0558153995132,"d":"293.0558"},{"v":293.0558153995528,"d":"293.0558"},{"$f":"CI51+$V$27","v":{"v":293.0558153995802,"d":"293.0558"}},{"v":293.0558153995992,"d":"293.0558"},{"v":293.05581539961247,"d":"293.0558"},{"v":293.0558153996216,"d":"293.0558"},{"v":293.055815399628,"d":"293.0558"},{"v":293.05581539963237,"d":"293.0558"},{"v":293.05581539963543,"d":"293.0558"},{"v":293.05581539963754,"d":"293.0558"},{"v":293.055815399639,"d":"293.0558"},{"v":293.05581539964004,"d":"293.0558"},{"v":293.0558153996408,"d":"293.0558"},{"v":293.05581539964123,"d":"293.0558"},{"v":293.0558153996416,"d":"293.0558"},{"v":293.0558153996418,"d":"293.0558"},{"v":293.055815399642,"d":"293.0558"},{"v":293.0558153996421,"d":"293.0558"},{"v":293.0558153996422,"d":"293.0558"},{"v":293.05581539964226,"d":"293.0558"},{"v":293.05581539964226,"d":"293.0558"},{"v":293.0558153996423,"d":"293.0558"},{"v":293.0558153996423,"d":"293.0558"},{"v":293.0558153996423,"d":"293.0558"},{"v":293.05581539964237,"d":"293.0558"},{"v":293.05581539964237,"d":"293.0558"},{"v":293.05581539964237,"d":"293.0558"},{"v":293.05581539964237,"d":"293.0558"},{"v":293.05581539964237,"d":"293.0558"},{"v":293.05581539964237,"d":"293.0558"},{"v":293.05581539964237,"d":"293.0558"},{"v":293.05581539964237,"d":"293.0558"},{"v":293.05581539964237,"d":"293.0558"},{"v":293.05581539964237,"d":"293.0558"},{"v":293.05581539964237,"d":"293.0558"},{"v":293.05581539964237,"d":"293.0558"},{"v":293.05581539964237,"d":"293.0558"},{"v":293.05581539964237,"d":"293.0558"},{"v":293.05581539964237,"d":"293.0558"},{"v":293.05581539964237,"d":"293.0558"},{"v":293.05581539964237,"d":"293.0558"},{"v":293.05581539964237,"d":"293.0558"},{"v":293.05581539964237,"d":"293.0558"},{"v":293.05581539964237,"d":"293.0558"},{"v":293.05581539964237,"d":"293.0558"},{"v":293.05581539964237,"d":"293.0558"},{"v":293.05581539964237,"d":"293.0558"},{"v":293.05581539964237,"d":"293.0558"},{"v":293.05581539964237,"d":"293.0558"},{"v":293.05581539964237,"d":"293.0558"},{"v":293.05581539964237,"d":"293.0558"},{"v":293.05581539964237,"d":"293.0558"},{"v":293.05581539964237,"d":"293.0558"},{"v":293.05581539964237,"d":"293.0558"},{"v":293.05581539964237,"d":"293.0558"},{"v":293.05581539964237,"d":"293.0558"},{"v":293.05581539964237,"d":"293.0558"},{"v":293.05581539964237,"d":"293.0558"}]
[{"$nulls":20},"Pvs",{"$f":"IF(V52<$V$27,EXP($U$33/V52+$U$34+$U$35*V52+$U$36*(V52)^2+$U$37*(V52^3)+$U$38*(V52^4)+$U$39*LN(V52)),EXP($V$33/V52+$V$34+$V$35*V52+$V$36*(V52)^2+$V$37*(V52^3)+$V$38*(V52^4)+$V$39*LN(V52)))","v":{"v":2197.949531962587,"d":"2197.9495"}},{"$f":"IF(W52<$V$27,EXP($U$33/W52+$U$34+$U$35*W52+$U$36*(W52)^2+$U$37*(W52^3)+$U$38*(W52^4)+$U$39*LN(W52)),EXP($V$33/W52+$V$34+$V$35*W52+$V$36*(W52)^2+$V$37*(W52^3)+$V$38*(W52^4)+$V$39*LN(W52)))","v":{"v":2236.3321393955944,"d":"2236.3321"}},{"v":2263.261849245484,"d":"2263.2618"},{"v":2282.090658140824,"d":"2282.0907"},{"v":2295.2240281879567,"d":"2295.2240"},{"v":2304.369641873682,"d":"2304.3696"},{"v":2310.731059953137,"d":"2310.7311"},{"v":2315.152380240729,"d":"2315.1524"},{"v":2318.223610585672,"d":"2318.2236"},{"v":2320.356204295033,"d":"2320.3562"},{"v":2321.8366404839558,"d":"2321.8366"},{"v":2322.864164776446,"d":"2322.8642"},{"v":2323.577246985793,"d":"2323.5772"},{"v":2324.072069012988,"d":"2324.0721"},{"v":2324.415415044519,"d":"2324.4154"},{"v":2324.653645190042,"d":"2324.6536"},{"v":2324.818935992558,"d":"2324.8189"},{"v":2324.933617090439,"d":"2324.9336"},{"v":2325.0131833381465,"d":"2325.0132"},{"v":2325.068386209585,"d":"2325.0684"},{"v":2325.106685569455,"d":"2325.1067"},{"v":2325.1332572681563,"d":"2325.1333"},{"v":2325.1516923769354,"d":"2325.1517"},{"v":2325.1644823935517,"d":"2325.1645"},{"v":2325.1733559114314,"d":"2325.1734"},{"v":2325.17951221571,"d":"2325.1795"},{"v":2325.1837833575682,"d":"2325.1838"},{"v":2325.1867466034228,"d":"2325.1867"},{"v":2325.1888024524783,"d":"2325.1888"},{"v":2325.1902287648268,"d":"2325.1902"},{"v":2325.1912183153845,"d":"2325.1912"},{"v":2325.191904848185,"d":"2325.1919"},{"v":2325.19238115252,"d":"2325.1924"},{"v":2325.1927116040792,"d":"2325.1927"},{"v":2325.1929408654837,"d":"2325.1929"},{"v":2325.193099923007,"d":"2325.1931"},{"v":2325.1932102743003,"d":"2325.1932"},null,{"v":2325.193286834067,"d":"2325.1933"},{"v":2325.193339949863,"d":"2325.1933"},{"v":2325.193376800664,"d":"2325.1934"},{"v":2325.1934023671038,"d":"2325.1934"},{"v":2325.193420104628,"d":"2325.1934"},{"v":2325.193432410629,"d":"2325.1934"},{"v":2325.1934409483006,"d":"2325.1934"},{"v":2325.1934468715613,"d":"2325.1934"},{"v":2325.193450981068,"d":"2325.1935"},{"v":2325.1934538321325,"d":"2325.1935"},{"v":2325.193455810135,"d":"2325.1935"},{"v":2325.193457182493,"d":"2325.1935"},{"v":2325.1934581345854,"d":"2325.1935"},{"v":2325.193458795123,"d":"2325.1935"},{"v":2325.193459253396,"d":"2325.1935"},{"v":2325.193459571319,"d":"2325.1935"},{"v":2325.193459791906,"d":"2325.1935"},{"v":2325.193459944953,"d":"2325.1935"},{"v":2325.19346005112,"d":"2325.1935"},{"v":2325.1934601247813,"d":"2325.1935"},{"v":2325.1934601758903,"d":"2325.1935"},{"v":2325.1934602113456,"d":"2325.1935"},{"v":2325.193460235938,"d":"2325.1935"},{"v":2325.193460253021,"d":"2325.1935"},{"v":2325.1934602648503,"d":"2325.1935"},{"v":2325.1934602730616,"d":"2325.1935"},{"v":2325.1934602787696,"d":"2325.1935"},{"v":2325.1934602827264,"d":"2325.1935"},{"$f":"IF(CJ52<$V$27,EXP($U$33/CJ52+$U$34+$U$35*CJ52+$U$36*(CJ52)^2+$U$37*(CJ52^3)+$U$38*(CJ52^4)+$U$39*LN(CJ52)),EXP($V$33/CJ52+$V$34+$V$35*CJ52+$V$36*(CJ52)^2+$V$37*(CJ52^3)+$V$38*(CJ52^4)+$V$39*LN(CJ52)))","v":{"v":2325.193460285461,"d":"2325.1935"}},{"v":2325.193460287369,"d":"2325.1935"},{"v":2325.1934602886827,"d":"2325.1935"},{"v":2325.1934602896076,"d":"2325.1935"},{"v":2325.1934602902274,"d":"2325.1935"},{"v":2325.1934602906736,"d":"2325.1935"},{"v":2325.193460290979,"d":"2325.1935"},{"v":2325.193460291194,"d":"2325.1935"},{"v":2325.1934602913425,"d":"2325.1935"},{"v":2325.193460291458,"d":"2325.1935"},{"v":2325.1934602914994,"d":"2325.1935"},{"v":2325.193460291574,"d":"2325.1935"},{"v":2325.1934602916067,"d":"2325.1935"},{"v":2325.1934602916153,"d":"2325.1935"},{"v":2325.1934602916235,"d":"2325.1935"},{"v":2325.193460291648,"d":"2325.1935"},{"v":2325.193460291648,"d":"2325.1935"},{"v":2325.193460291648,"d":"2325.1935"},{"v":2325.1934602916895,"d":"2325.1935"},{"v":2325.1934602916895,"d":"2325.1935"},{"v":2325.1934602916895,"d":"2325.1935"},{"v":2325.1934602916895,"d":"2325.1935"},{"v":2325.1934602916895,"d":"2325.1935"},{"v":2325.1934602916895,"d":"2325.1935"},{"v":2325.1934602916895,"d":"2325.1935"},{"v":2325.1934602916895,"d":"2325.1935"},{"v":2325.1934602916895,"d":"2325.1935"},{"v":2325.1934602916895,"d":"2325.1935"},{"v":2325.1934602916895,"d":"2325.1935"},{"v":2325.1934602916895,"d":"2325.1935"},{"v":2325.1934602916895,"d":"2325.1935"},{"v":2325.1934602916895,"d":"2325.1935"},{"v":2325.1934602916895,"d":"2325.1935"},{"v":2325.1934602916895,"d":"2325.1935"},{"v":2325.1934602916895,"d":"2325.1935"},{"v":2325.1934602916895,"d":"2325.1935"},{"v":2325.1934602916895,"d":"2325.1935"},{"v":2325.1934602916895,"d":"2325.1935"},{"v":2325.1934602916895,"d":"2325.1935"},{"v":2325.1934602916895,"d":"2325.1935"},{"v":2325.1934602916895,"d":"2325.1935"},{"v":2325.1934602916895,"d":"2325.1935"},{"v":2325.1934602916895,"d":"2325.1935"},{"v":2325.1934602916895,"d":"2325.1935"},{"v":2325.1934602916895,"d":"2325.1935"},{"v":2325.1934602916895,"d":"2325.1935"},{"v":2325.1934602916895,"d":"2325.1935"},{"v":2325.1934602916895,"d":"2325.1935"},{"v":2325.1934602916895,"d":"2325.1935"},{"v":2325.1934602916895,"d":"2325.1935"},{"v":2325.1934602916895,"d":"2325.1935"},{"v":2325.1934602916895,"d":"2325.1935"},{"v":2325.1934602916895,"d":"2325.1935"},{"v":2325.1934602916895,"d":"2325.1935"},{"v":2325.1934602916895,"d":"2325.1935"}]
[{"$nulls":20},"x",{"$f":"621.98*$V$32*$V$48*V53/($W$42-$V$32*$V$48*V53)","v":{"v":6.847568641607285,"d":"6.8476"}},{"$f":"621.98*$V$32*$V$48*W53/($W$42-$V$32*$V$48*W53)","v":{"v":6.968486879315925,"d":"6.9685"}},{"v":7.053352366480649,"d":"7.0534"},{"v":7.11270252082631,"d":"7.1127"},{"v":7.154106753757146,"d":"7.1541"},{"v":7.1829424141537626,"d":"7.1829"},{"v":7.2030012044947895,"d":"7.2030"},{"v":7.216943241993785,"d":"7.2169"},{"v":7.226628316541881,"d":"7.2266"},{"v":7.2333535912462645,"d":"7.2334"},{"v":7.238022328804608,"d":"7.2380"},{"v":7.241262793738934,"d":"7.2413"},{"v":7.243511634053754,"d":"7.2435"},{"v":7.245072158837124,"d":"7.2451"},{"v":7.2461549769270714,"d":"7.2462"},{"v":7.246906290876796,"d":"7.2469"},{"v":7.247427574766294,"d":"7.2474"},{"v":7.247789249413238,"d":"7.2478"},{"v":7.248040181110763,"d":"7.2480"},{"v":7.2482142770370395,"d":"7.2482"},{"v":7.248335063609975,"d":"7.2483"},{"v":7.2484188641089276,"d":"7.2484"},{"v":7.248477003849252,"d":"7.2485"},{"v":7.248517340381577,"d":"7.2485"},{"v":7.248545325253715,"d":"7.2485"},{"v":7.2485647407102896,"d":"7.2486"},{"v":7.248578210832925,"d":"7.2486"},{"v":7.24858755617612,"d":"7.2486"},{"v":7.248594039814807,"d":"7.2486"},{"v":7.248598538050738,"d":"7.2486"},{"v":7.248601658848177,"d":"7.2486"},{"v":7.248603824002659,"d":"7.2486"},{"v":7.248605326148617,"d":"7.2486"},{"v":7.248606368311031,"d":"7.2486"},{"v":7.24860709134475,"d":"7.2486"},{"v":7.248607592972807,"d":"7.2486"},{"v":7.2486079409934705,"d":"7.2486"},null,{"v":7.248608182444023,"d":"7.2486"},{"v":7.248608349958097,"d":"7.2486"},{"v":7.248608466176402,"d":"7.2486"},{"v":7.248608546806626,"d":"7.2486"},{"v":7.248608602746385,"d":"7.2486"},{"v":7.2486086415564674,"d":"7.2486"},{"v":7.24860866848217,"d":"7.2486"},{"v":7.248608687162668,"d":"7.2486"},{"v":7.248608700123035,"d":"7.2486"},{"v":7.248608709114587,"d":"7.2486"},{"v":7.2486087153527174,"d":"7.2486"},{"v":7.248608719680795,"d":"7.2486"},{"v":7.248608722683459,"d":"7.2486"},{"v":7.2486087247666315,"d":"7.2486"},{"v":7.248608726211911,"d":"7.2486"},{"v":7.248608727214561,"d":"7.2486"},{"v":7.248608727910238,"d":"7.2486"},{"v":7.248608728392909,"d":"7.2486"},{"v":7.248608728727733,"d":"7.2486"},{"v":7.248608728960044,"d":"7.2486"},{"v":7.248608729121229,"d":"7.2486"},{"v":7.2486087292330454,"d":"7.2486"},{"v":7.248608729310605,"d":"7.2486"},{"v":7.24860872936448,"d":"7.2486"},{"v":7.248608729401788,"d":"7.2486"},{"v":7.2486087294276835,"d":"7.2486"},{"v":7.248608729445685,"d":"7.2486"},{"v":7.248608729458164,"d":"7.2486"},{"$f":"621.98*$V$32*$V$48*CJ53/($W$42-$V$32*$V$48*CJ53)","v":{"v":7.248608729466787,"d":"7.2486"}},{"v":7.248608729472804,"d":"7.2486"},{"v":7.248608729476949,"d":"7.2486"},{"v":7.248608729479866,"d":"7.2486"},{"v":7.24860872948182,"d":"7.2486"},{"v":7.248608729483226,"d":"7.2486"},{"v":7.24860872948419,"d":"7.2486"},{"v":7.248608729484867,"d":"7.2486"},{"v":7.248608729485338,"d":"7.2486"},{"v":7.2486087294857,"d":"7.2486"},{"v":7.248608729485831,"d":"7.2486"},{"v":7.248608729486065,"d":"7.2486"},{"v":7.24860872948617,"d":"7.2486"},{"v":7.248608729486197,"d":"7.2486"},{"v":7.2486087294862225,"d":"7.2486"},{"v":7.2486087294863,"d":"7.2486"},{"v":7.2486087294863,"d":"7.2486"},{"v":7.2486087294863,"d":"7.2486"},{"v":7.24860872948643,"d":"7.2486"},{"v":7.24860872948643,"d":"7.2486"},{"v":7.24860872948643,"d":"7.2486"},{"v":7.24860872948643,"d":"7.2486"},{"v":7.24860872948643,"d":"7.2486"},{"v":7.24860872948643,"d":"7.2486"},{"v":7.24860872948643,"d":"7.2486"},{"v":7.24860872948643,"d":"7.2486"},{"v":7.24860872948643,"d":"7.2486"},{"v":7.24860872948643,"d":"7.2486"},{"v":7.24860872948643,"d":"7.2486"},{"v":7.24860872948643,"d":"7.2486"},{"v":7.24860872948643,"d":"7.2486"},{"v":7.24860872948643,"d":"7.2486"},{"v":7.24860872948643,"d":"7.2486"},{"v":7.24860872948643,"d":"7.2486"},{"v":7.24860872948643,"d":"7.2486"},{"v":7.24860872948643,"d":"7.2486"},{"v":7.24860872948643,"d":"7.2486"},{"v":7.24860872948643,"d":"7.2486"},{"v":7.24860872948643,"d":"7.2486"},{"v":7.24860872948643,"d":"7.2486"},{"v":7.24860872948643,"d":"7.2486"},{"v":7.24860872948643,"d":"7.2486"},{"v":7.24860872948643,"d":"7.2486"},{"v":7.24860872948643,"d":"7.2486"},{"v":7.24860872948643,"d":"7.2486"},{"v":7.24860872948643,"d":"7.2486"},{"v":7.24860872948643,"d":"7.2486"},{"v":7.24860872948643,"d":"7.2486"},{"v":7.24860872948643,"d":"7.2486"},{"v":7.24860872948643,"d":"7.2486"},{"v":7.24860872948643,"d":"7.2486"},{"v":7.24860872948643,"d":"7.2486"},{"v":7.24860872948643,"d":"7.2486"},{"v":7.24860872948643,"d":"7.2486"},{"v":7.24860872948643,"d":"7.2486"}]
[{"$nulls":20},"z",{"$f":"($V$49*($V$28+$V$29*(V54/1000))+((V54-$V$50)/1000)*(2685-$V$30))/($V$28+$V$29*(V54/1000))","v":{"v":19.83399748167196,"d":"19.8340"}},{"$f":"($V$49*($V$28+$V$29*(W54/1000))+((W54-$V$50)/1000)*(2685-$V$30))/($V$28+$V$29*(W54/1000))","v":{"v":19.85566216584117,"d":"19.8557"}},{"v":19.870861805242207,"d":"19.8709"},{"v":19.881488863323387,"d":"19.8815"},{"v":19.888901256067356,"d":"19.8889"},{"v":19.894062917819653,"d":"19.8941"},{"v":19.89765318495031,"d":"19.8977"},{"v":19.90014848120122,"d":"19.9001"},{"v":19.901881808831302,"d":"19.9019"},{"v":19.903085389203618,"d":"19.9031"},{"v":19.90392090711659,"d":"19.9039"},{"v":19.90450081304113,"d":"19.9045"},{"v":19.904903256261086,"d":"19.9049"},{"v":19.905182519478277,"d":"19.9052"},{"v":19.90537629393856,"d":"19.9054"},{"v":19.905510744021647,"d":"19.9055"},{"v":19.905604029264527,"d":"19.9056"},{"v":19.90566875187575,"d":"19.9057"},{"v":19.905713656701728,"d":"19.9057"},{"v":19.90574481155966,"d":"19.9057"},{"v":19.905766426577518,"d":"19.9058"},{"v":19.905781422852186,"d":"19.9058"},{"v":19.905791827077785,"d":"19.9058"},{"v":19.905799045381585,"d":"19.9058"},{"v":19.905804053330286,"d":"19.9058"},{"v":19.905807527764686,"d":"19.9058"},{"v":19.905809938269662,"d":"19.9058"},{"v":19.905811610637166,"d":"19.9058"},{"v":19.905812770897,"d":"19.9058"},{"v":19.905813575865107,"d":"19.9058"},{"v":19.9058141343379,"d":"19.9058"},{"v":19.90581452179652,"d":"19.9058"},{"v":19.905814790608467,"d":"19.9058"},{"v":19.905814977105454,"d":"19.9058"},{"v":19.90581510649375,"d":"19.9058"},{"v":19.905815196261067,"d":"19.9058"},{"v":19.90581525854004,"d":"19.9058"},null,{"v":19.90581530174809,"d":"19.9058"},{"v":19.90581533172506,"d":"19.9058"},{"v":19.90581535252255,"d":"19.9058"},{"v":19.905815366951483,"d":"19.9058"},{"v":19.905815376962014,"d":"19.9058"},{"v":19.90581538390715,"d":"19.9058"},{"v":19.90581538872556,"d":"19.9058"},{"v":19.905815392068472,"d":"19.9058"},{"v":19.905815394387755,"d":"19.9058"},{"v":19.90581539599681,"d":"19.9058"},{"v":19.905815397113138,"d":"19.9058"},{"v":19.905815397887654,"d":"19.9058"},{"v":19.905815398424988,"d":"19.9058"},{"v":19.905815398797774,"d":"19.9058"},{"v":19.905815399056408,"d":"19.9058"},{"v":19.905815399235838,"d":"19.9058"},{"v":19.90581539936033,"d":"19.9058"},{"v":19.905815399446706,"d":"19.9058"},{"v":19.905815399506622,"d":"19.9058"},{"v":19.905815399548196,"d":"19.9058"},{"v":19.905815399577037,"d":"19.9058"},{"v":19.90581539959705,"d":"19.9058"},{"v":19.90581539961093,"d":"19.9058"},{"v":19.90581539962057,"d":"19.9058"},{"v":19.905815399627244,"d":"19.9058"},{"v":19.90581539963188,"d":"19.9058"},{"v":19.905815399635102,"d":"19.9058"},{"$f":"($V$49*($V$28+$V$29*(CI54/1000))+((CI54-$V$50)/1000)*(2685-$V$30))/($V$28+$V$29*(CI54/1000))","v":{"v":19.905815399637333,"d":"19.9058"}},{"v":19.905815399638875,"d":"19.9058"},{"v":19.905815399639952,"d":"19.9058"},{"v":19.905815399640694,"d":"19.9058"},{"v":19.905815399641217,"d":"19.9058"},{"v":19.905815399641565,"d":"19.9058"},{"v":19.905815399641817,"d":"19.9058"},{"v":19.90581539964199,"d":"19.9058"},{"v":19.905815399642112,"d":"19.9058"},{"v":19.905815399642194,"d":"19.9058"},{"v":19.90581539964226,"d":"19.9058"},{"v":19.905815399642282,"d":"19.9058"},{"v":19.90581539964233,"d":"19.9058"},{"v":19.905815399642343,"d":"19.9058"},{"v":19.90581539964235,"d":"19.9058"},{"v":19.905815399642353,"d":"19.9058"},{"v":19.905815399642368,"d":"19.9058"},{"v":19.905815399642368,"d":"19.9058"},{"v":19.905815399642368,"d":"19.9058"},{"v":19.905815399642393,"d":"19.9058"},{"v":19.905815399642393,"d":"19.9058"},{"v":19.905815399642393,"d":"19.9058"},{"v":19.905815399642393,"d":"19.9058"},{"v":19.905815399642393,"d":"19.9058"},{"v":19.905815399642393,"d":"19.9058"},{"v":19.905815399642393,"d":"19.9058"},{"v":19.905815399642393,"d":"19.9058"},{"v":19.905815399642393,"d":"19.9058"},{"v":19.905815399642393,"d":"19.9058"},{"v":19.905815399642393,"d":"19.9058"},{"v":19.905815399642393,"d":"19.9058"},{"v":19.905815399642393,"d":"19.9058"},{"v":19.905815399642393,"d":"19.9058"},{"v":19.905815399642393,"d":"19.9058"},{"v":19.905815399642393,"d":"19.9058"},{"v":19.905815399642393,"d":"19.9058"},{"v":19.905815399642393,"d":"19.9058"},{"v":19.905815399642393,"d":"19.9058"},{"v":19.905815399642393,"d":"19.9058"},{"v":19.905815399642393,"d":"19.9058"},{"v":19.905815399642393,"d":"19.9058"},{"v":19.905815399642393,"d":"19.9058"},{"v":19.905815399642393,"d":"19.9058"},{"v":19.905815399642393,"d":"19.9058"},{"v":19.905815399642393,"d":"19.9058"},{"v":19.905815399642393,"d":"19.9058"},{"v":19.905815399642393,"d":"19.9058"},{"v":19.905815399642393,"d":"19.9058"},{"v":19.905815399642393,"d":"19.9058"},{"v":19.905815399642393,"d":"19.9058"},{"v":19.905815399642393,"d":"19.9058"},{"v":19.905815399642393,"d":"19.9058"},{"v":19.905815399642393,"d":"19.9058"},{"v":19.905815399642393,"d":"19.9058"},{"v":19.905815399642393,"d":"19.9058"},{"v":19.905815399642393,"d":"19.9058"}]
[{"$nulls":20},"Dz",{"$f":"V55-V51","v":{"v":0.8328811608092543,"d":"0.8329"}},{"$f":"W55-W51","v":{"v":0.5769187913753804,"d":"0.5769"}},{"v":0.3998121669846242,"d":"0.3998"},{"v":0.2771685027375952,"d":"0.2772"},{"v":0.19219139456903278,"d":"0.1922"},{"v":0.1332892581316507,"d":"0.1333"},{"v":0.09244977255175968,"d":"0.0924"},{"v":0.06412847795208165,"d":"0.0641"},{"v":0.044485646264803336,"d":"0.0445"},{"v":0.030860677882184717,"d":"0.0309"},{"v":0.02140930316776135,"d":"0.0214"},{"v":0.0148527747030478,"d":"0.0149"},{"v":0.010304293021988542,"d":"0.0103"},{"v":0.007148791898515583,"d":"0.0071"},{"v":0.004959635725960254,"d":"0.0050"},{"v":3.4408739003950473E-3,"d":"0.0034"},{"v":2.3872011764751733E-3,"d":"0.0024"},{"v":1.6561900622065195E-3,"d":"0.0017"},{"v":1.1490315341156077E-3,"d":"0.0011"},{"v":7.9717588067751421E-4,"d":"0.0008"},{"v":5.530656049756999E-4,"d":"0.0006"},{"v":3.8370667798659497E-4,"d":"0.0004"},{"v":2.6620867759064026E-4,"d":"0.0003"},{"v":1.8469075552829395E-4,"d":"0.0002"},{"v":1.281351190520752E-4,"d":"0.0001"},{"v":8.8897847103197591E-5,"d":"0.0001"},{"v":6.1675736379385171E-5,"d":"0.0001"},{"v":4.2789525089403924E-5,"d":"0.0000"},{"v":2.9686609895662741E-5,"d":"0.0000"},{"v":2.0596041370168905E-5,"d":"0.0000"},{"v":1.4289167037162542E-5,"d":"0.0000"},{"v":9.9135699791474963E-6,"d":"0.0000"},{"v":6.8778586026496669E-6,"d":"0.0000"},{"v":4.7717360551757793E-6,"d":"0.0000"},{"v":3.3105456687110291E-6,"d":"3.3105E-06"},{"v":2.2967977599819278E-6,"d":"2.2968E-06"},{"v":1.593477481520722E-6,"d":"1.5935E-06"},null,{"v":1.1055263691162054E-6,"d":"1.1055E-06"},{"v":7.6699454965023506E-7,"d":"7.6699E-07"},{"v":5.3212718853501428E-7,"d":"5.3213E-07"},{"v":3.6918039469924224E-7,"d":"3.6918E-07"},{"v":2.5613079301933794E-7,"d":"2.5613E-07"},{"v":1.7769899685049495E-7,"d":"1.7770E-07"},{"v":1.2328440845976729E-7,"d":"1.2328E-07"},{"v":8.5532516180819584E-8,"d":"8.5533E-08"},{"v":5.9340958813436373E-8,"d":"5.9341E-08"},{"v":4.1169695208509438E-8,"d":"4.1170E-08"},{"v":2.8562791243302854E-8,"d":"2.8563E-08"},{"v":1.9816376095604937E-8,"d":"1.9816E-08"},{"v":1.3748252314371712E-8,"d":"1.3748E-08"},{"v":9.5382866049931181E-9,"d":"9.5383E-09"},{"v":6.6174905555271835E-9,"d":"6.6175E-09"},{"v":4.5910901746992749E-9,"d":"4.5911E-09"},{"v":3.1852174231516983E-9,"d":"3.1852E-09"},{"v":2.2098554097738088E-9,"d":"2.2099E-09"},{"v":1.5331522718042834E-9,"d":"1.5332E-09"},{"v":1.0636753700055124E-9,"d":"1.0637E-09"},{"v":7.379590272194037e-10,"d":"7.3796E-10"},{"v":5.11985120965619e-10,"d":"5.1199E-10"},{"v":3.552038663201529e-10,"d":"3.5520E-10"},{"v":2.4644108975735435E-10,"d":"2.4644E-10"},{"v":1.709707930785953e-10,"d":"1.7097E-10"},{"v":1.1861800430779113E-10,"d":"1.1862E-10"},{"v":8.23021650830924e-11,"d":"8.2302E-11"},{"$f":"CI55-CI51","v":{"v":5.709921424568165e-11,"d":"5.7099E-11"}},{"v":3.9609204804946785E-11,"d":"3.9609E-11"},{"v":2.7483793019200675E-11,"d":"2.7484E-11"},{"v":1.9063861600443488E-11,"d":"1.9064E-11"},{"v":1.3230305739853065E-11,"d":"1.3230E-11"},{"v":9.169554004984093e-12,"d":"9.1696E-12"},{"v":6.366462912410498e-12,"d":"6.3665E-12"},{"v":4.419575816427823e-12,"d":"4.4196E-12"},{"v":3.0659919048048323E-12,"d":"3.0660E-12"},{"v":2.1245227799226996E-12,"d":"2.1245E-12"},{"v":1.4850343177386094E-12,"d":"1.4850E-12"},{"v":1.0125233984581428E-12,"d":"1.0125E-12"},{"v":7.212008767965017e-13,"d":"7.2120E-13"},{"v":4.938272013532696e-13,"d":"4.9383E-13"},{"v":3.375077994860476e-13,"d":"3.3751E-13"},{"v":2.2737367544323206E-13,"d":"2.2737E-13"},{"v":1.6697754290362354E-13,"d":"1.6698E-13"},{"v":1.1013412404281553E-13,"d":"1.1013E-13"},{"v":7.460698725481052E-14,"d":"7.4607E-14"},{"v":7.460698725481052E-14,"d":"7.4607E-14"},{"v":4.973799150320701e-14,"d":"4.9738E-14"},{"v":3.197442310920451e-14,"d":"3.1974E-14"},{"v":0,"d":"0.0000E+00"},{"v":0,"d":"0.0000E+00"},{"v":0,"d":"0.0000E+00"},{"v":0,"d":"0.0000E+00"},{"v":0,"d":"0.0000E+00"},{"v":0,"d":"0.0000E+00"},{"v":0,"d":"0.0000E+00"},{"v":0,"d":"0.0000E+00"},{"v":0,"d":"0.0000E+00"},{"v":0,"d":"0.0000E+00"},{"v":0,"d":"0.0000E+00"},{"v":0,"d":"0.0000E+00"},{"v":0,"d":"0.0000E+00"},{"v":0,"d":"0.0000E+00"},{"v":0,"d":"0.0000E+00"},{"v":0,"d":"0.0000E+00"},{"v":0,"d":"0.0000E+00"},{"v":0,"d":"0.0000E+00"},{"v":0,"d":"0.0000E+00"},{"v":0,"d":"0.0000E+00"},{"v":0,"d":"0.0000E+00"},{"v":0,"d":"0.0000E+00"},{"v":0,"d":"0.0000E+00"},{"v":0,"d":"0.0000E+00"},{"v":0,"d":"0.0000E+00"},{"v":0,"d":"0.0000E+00"},{"v":0,"d":"0.0000E+00"},{"v":0,"d":"0.0000E+00"},{"v":0,"d":"0.0000E+00"},{"v":0,"d":"0.0000E+00"},{"v":0,"d":"0.0000E+00"},{"v":0,"d":"0.0000E+00"},{"v":0,"d":"0.0000E+00"},{"v":0,"d":"0.0000E+00"}]
[{"$nulls":20},"k",{"$f":"GRAFICI!M3","v":3},{"$f":"V57","v":3},3,3,3,3,3,3,3,3,3,3,3,3,3,3,3,3,3,3,3,3,3,3,3,3,3,3,3,3,3,3,3,3,3,3,3,null,{"$f":"BF57","v":3},3,3,3,3,3,3,3,3,3,3,3,3,3,3,3,3,3,3,3,3,3,3,3,3,3,3,3,{"$f":"CI57","v":3},3,3,3,3,3,3,3,3,3,3,3,3,3,3,3,3,3,3,3,3,3,3,3,3,3,3,3,3,3,3,3,3,3,3,3,3,3,3,3,3,3,3,3,3,3,3,3,3,3,3,3,3,3,3]
[]
[{"$nulls":20},"Errore",null,{"$f":"EL56","v":{"v":0,"d":"0.0000E+00"}}]
[{"$nulls":20},"Temperatura °C",null,{"$f":"AVERAGE(EL51,EL55)","v":{"v":19.905815399642382,"d":"19.9058"}}]
[{"$nulls":20},"Umidità specifica g/kg",null,{"$f":"DZ54","v":{"v":7.24860872948643,"d":"7.2"}}]
[]
[]
[{"$nulls":20},"Tabella UE*X",{"$nulls":13},"Tabella UR*H",{"$nulls":11},"Tabella UE*Y"]
[]
[{"$nulls":20},"Portata minima ",null,{"$f":"GRAFICI!M7","v":{"v":0.5,"d":"50%"}},{"$nulls":11},"Portata minima ",null,{"$f":"W66","v":{"v":0.5,"d":"50%"}},{"$nulls":9},"Portata minima ",null,{"$f":"+W66","v":{"v":0.5,"d":"50%"}}]
[{"$nulls":20},"Massimo numero umi",null,{"$f":"GRAFICI!M6","v":1},{"$nulls":11},"Massimo numero umi",null,{"$f":"W67","v":1},{"$nulls":9},"Massimo numero umi",null,{"$f":"+W67","v":1}]
[]
[null,null,{"$f":"LINGUA!C517","v":"WARNING: the pre-heating must be supplied by an external device"},{"$nulls":17},"#","Code","Max","Uscite","d_uscite","230 1~","400 3~","#_umi","Max_flow","Min_flow","Si/No","Quale",null,null,"#","Code","Max","Uscite","d_uscite","#_umi","Max_flow","Min_flow","Si/No","Quale",null,null,"#","Code","Max","Uscite","d_uscite","230 1~","400 3~","#_umi","Max_flow","Min_flow","Si/No","Quale"]
[{"$nulls":20},1,"UE001",1.5,1,22,1,null,{"$f":"CEILING($E$84/W70,1)","v":41},{"$f":"MIN(AB70,$W$67)*W70","v":1.5},{"$f":"AC70*$W$66","v":0.75},{"$f":"IF(OR(AC70=$E$84,AC70>$E$84),IF(OR(AD70=$E$84,AD70<$E$84),1,0),0)","v":0},{"$f":"AE70*U70","v":0},null,null,27,"UR002HD002",2,1,30,{"$f":"CEILING($E$84/AK70,1)","v":31},{"$f":"MIN(AN70,$AK$67)*AK70","v":2},{"$f":"AO70*$AK$66","v":1},{"$f":"IF(OR(AO70=$E$84,AO70>$E$84),IF(OR(AP70=$E$84,AP70<$E$84),1,0),0)","v":0},{"$f":"AQ70*AI70","v":0},null,null,15,"UE001",1.5,1,22,1,null,{"$f":"CEILING($E$84/AW70,1)","v":41},{"$f":"MIN(BB70,$W$67)*AW70","v":1.5},{"$f":"BC70*$W$66","v":0.75},{"$f":"IF(OR(BC70=$E$84,BC70>$E$84),IF(OR(BD70=$E$84,BD70<$E$84),1,0),0)","v":0},{"$f":"BE70*AU70","v":0}]
[null,{"$f":"LINGUA!B54","v":"STEP 2"},{"$nulls":18},{"$f":"U70+1","v":2},"UE003",3,1,22,1,1,21,3,1.5,0,{"$f":"IF(SUM(AF$70:AF70)=0,AE71,0)*U71","v":0},null,null,{"$f":"AI70+1","v":28},"UR004HD002",4,1,30,{"$f":"CEILING($E$84/AK71,1)","v":16},{"$f":"MIN(AN71,$AK$67)*AK71","v":4},{"$f":"AO71*$AK$66","v":2},{"$f":"IF(OR(AO71=$E$84,AO71>$E$84),IF(OR(AP71=$E$84,AP71<$E$84),1,0),0)","v":0},{"$f":"IF(SUM(AR$70:AR70)=0,AQ71,0)*AI71","v":0},null,null,{"$f":"AU70+1","v":16},"UE003",3,1,22,1,1,21,3,1.5,0,{"$f":"IF(SUM(BF$70:BF70)=0,BE71,0)*AU71","v":0}]
[{"$nulls":20},{"$f":"U71+1","v":3},"UE005",5,1,30,1,1,13,5,2.5,0,{"$f":"IF(SUM(AF$70:AF71)=0,AE72,0)*U72","v":0},null,null,{"$f":"AI71+1","v":29},"UR006HD002",6,1,30,{"$f":"CEILING($E$84/AK72,1)","v":11},{"$f":"MIN(AN72,$AK$67)*AK72","v":6},{"$f":"AO72*$AK$66","v":3},{"$f":"IF(OR(AO72=$E$84,AO72>$E$84),IF(OR(AP72=$E$84,AP72<$E$84),1,0),0)","v":0},{"$f":"IF(SUM(AR$70:AR71)=0,AQ72,0)*AI72","v":0},null,null,17,"UE005",5,1,30,1,1,13,5,2.5,0,{"$f":"IF(SUM(BF$70:BF71)=0,BE72,0)*AU72","v":0}]
[{"$nulls":20},4,"UE008",8,1,30,null,1,8,8,4,0,{"$f":"IF(SUM(AF$70:AF72)=0,AE73,0)*U73","v":0},null,null,30,"UR010HL002",10,1,30,{"$f":"CEILING($E$84/AK73,1)","v":7},{"$f":"MIN(AN73,$AK$67)*AK73","v":10},{"$f":"AO73*$AK$66","v":5},{"$f":"IF(OR(AO73=$E$84,AO73>$E$84),IF(OR(AP73=$E$84,AP73<$E$84),1,0),0)","v":0},{"$f":"IF(SUM(AR$70:AR72)=0,AQ73,0)*AI73","v":0},null,null,18,"UE008",8,1,30,null,1,8,8,4,0,{"$f":"IF(SUM(BF$70:BF72)=0,BE73,0)*AU73","v":0}]
[null,null,{"$f":"LINGUA!B14","v":"Duct"},{"$nulls":17},5,"UE009",9,1,30,1,null,7,9,4.5,0,{"$f":"IF(SUM(AF$70:AF73)=0,AE74,0)*U74","v":0},null,null,31,"UR013HL002",13,1,30,{"$f":"CEILING($E$84/AK74,1)","v":5},{"$f":"MIN(AN74,$AK$67)*AK74","v":13},{"$f":"AO74*$AK$66","v":6.5},{"$f":"IF(OR(AO74=$E$84,AO74>$E$84),IF(OR(AP74=$E$84,AP74<$E$84),1,0),0)","v":0},{"$f":"IF(SUM(AR$70:AR73)=0,AQ74,0)*AI74","v":0},null,null,19,"UE009",9,1,30,1,null,7,9,4.5,0,{"$f":"IF(SUM(BF$70:BF73)=0,BE74,0)*AU74","v":0}]
[null,null,{"$f":"LINGUA!B15","v":"Internal width C1"},null,1200,{"$f":"LINGUA!K3","v":"mm"},{"$nulls":14},6,"UE010",10,1,30,null,1,7,10,5,0,{"$f":"IF(SUM(AF$70:AF74)=0,AE75,0)*U75","v":0},null,null,32,"UR020HL002",20,1,40,{"$f":"CEILING($E$84/AK75,1)","v":4},{"$f":"MIN(AN75,$AK$67)*AK75","v":20},{"$f":"AO75*$AK$66","v":10},{"$f":"IF(OR(AO75=$E$84,AO75>$E$84),IF(OR(AP75=$E$84,AP75<$E$84),1,0),0)","v":0},{"$f":"IF(SUM(AR$70:AR74)=0,AQ75,0)*AI75","v":0},null,null,20,"UE010",10,1,30,null,1,7,10,5,0,{"$f":"IF(SUM(BF$70:BF74)=0,BE75,0)*AU75","v":0}]
[null,null,{"$f":"LINGUA!B16","v":"Internal height C2"},null,1100,{"$f":"LINGUA!K3","v":"mm"},{"$nulls":14},7,"UE015",15,1,30,null,1,5,15,7.5,{"$f":"IF(OR(AC76=$E$84,AC76>$E$84),IF(OR(AD76=$E$84,AD76<$E$84),1,0),0)","v":0},{"$f":"IF(SUM(AF$70:AF75)=0,AE76,0)*U76","v":0},null,null,33,"UR027HL002",27,1,40,3,27,13.5,0,{"$f":"IF(SUM(AR$70:AR75)=0,AQ76,0)*AI76","v":0},null,null,21,"UE015",15,1,30,null,1,5,15,7.5,0,{"$f":"IF(SUM(BF$70:BF75)=0,BE76,0)*AU76","v":0}]
[null,null,{"$f":"LINGUA!B18","v":"Air flow V"},null,10000,{"$f":"LINGUA!K7","v":"m^3/h"},{"$nulls":14},{"$f":"U76+1","v":8},"UE018",18,1,30,null,1,4,{"$f":"MIN(AB77,$W$67)*W77","v":18},{"$f":"AC77*$W$66","v":9},0,{"$f":"IF(SUM(AF$70:AF76)=0,AE77,0)*U77","v":0},null,null,34,"UR040HL002",40,1,40,2,40,20,0,{"$f":"IF(SUM(AR$70:AR76)=0,AQ77,0)*AI77","v":0},null,null,22,"UE018",18,1,30,null,1,4,{"$f":"MIN(BB77,$W$67)*AW77","v":18},{"$f":"BC77*$W$66","v":9},0,{"$f":"IF(SUM(BF$70:BF76)=0,BE77,0)*AU77","v":0}]
[null,null,{"$f":"LINGUA!B19","v":"Air flow GA"},null,{"$f":"(E77*29*(AF42/(V31*(V27+AG43))))/(1+1.6078*J36/1000)","v":{"v":12054.746522973534,"d":"12,055"}},{"$f":"LINGUA!K8","v":"kg/h"},{"$nulls":14},9,"UE025",25,1,40,null,1,3,25,12.5,0,{"$f":"IF(SUM(AF$70:AF77)=0,AE78,0)*U78","v":0},null,null,35,"UR053HL002",53,2,40,2,53,26.5,0,{"$f":"IF(SUM(AR$70:AR77)=0,AQ78,0)*AI78","v":0},null,null,23,"UE025",25,1,40,null,1,3,{"$f":"MIN(BB78,$W$67)*AW78","v":25},12.5,0,{"$f":"IF(SUM(BF$70:BF77)=0,BE78,0)*AU78","v":0}]
[null,null,{"$f":"LINGUA!B20","v":"Air speed"},null,{"$f":"(1000*1000)*E77/(3600*E75*E76)","v":{"v":2.1043771043771042,"d":"2.10"}},{"$f":"LINGUA!K5","v":"m/sec"},{"$nulls":14},10,"UE035",35,1,40,null,1,2,35,17.5,0,{"$f":"IF(SUM(AF$70:AF78)=0,AE79,0)*U79","v":0},null,null,36,"UR060HL002",60,2,40,2,60,30,0,{"$f":"IF(SUM(AR$70:AR78)=0,AQ79,0)*AI79","v":0},null,null,24,"UE035",35,1,40,null,1,2,{"$f":"MIN(BB79,$W$67)*AW79","v":35},17.5,0,{"$f":"IF(SUM(BF$70:BF78)=0,BE79,0)*AU79","v":0}]
[{"$nulls":20},11,"UE045",45,1,40,null,1,2,45,22.5,0,{"$f":"IF(SUM(AF$70:AF79)=0,AE80,0)*U80","v":0},null,null,37,"UR080HL002",80,2,40,1,80,40,1,{"$f":"IF(SUM(AR$70:AR79)=0,AQ80,0)*AI80","v":37},null,null,25,"UE045",45,1,40,null,1,2,{"$f":"MIN(BB80,$W$67)*AW80","v":45},22.5,0,{"$f":"IF(SUM(BF$70:BF79)=0,BE80,0)*AU80","v":0}]
[{"$nulls":20},12,"UE065",65,2,40,null,1,1,65,32.5,1,{"$f":"IF(SUM(AF$70:AF80)=0,AE81,0)*U81","v":12},{"$nulls":14},26,"UE065",65,2,40,null,1,1,{"$f":"MIN(BB81,$W$67)*AW81","v":65},32.5,1,{"$f":"IF(SUM(BF$70:BF80)=0,BE81,0)*AU81","v":26}]
[{"$nulls":20},13,"UE090",90,2,40,null,1,1,90,45,1,{"$f":"IF(SUM(AF$70:AF81)=0,AE82,0)*U82","v":0}]
[{"$nulls":6},{"$f":"IF(D93=\"\",\"\",IF(GRAFICI!M10=\"No\",IF(V218>0,\"\",LINGUA!B22),IF(V255>0,\"\",LINGUA!B22)))","v":""},{"$nulls":13},14,"UE130",130,4,40,null,1,1,{"$f":"MIN(AB83,$W$67)*W83","v":130},65,0,{"$f":"IF(SUM(AF$70:AF82)=0,AE83,0)*U83","v":0}]
[null,{"$f":"LINGUA!B21","v":"Total water flow Gw"},null,null,{"$f":"IF(E40=\"\",E78*AI46/1000,0)","v":{"v":60.915771784495476,"d":"60.916"}},{"$f":"LINGUA!K8","v":"kg/h"},{"$nulls":3},{"$f":"IF(E76>GRAFICI!M11,\"\",LINGUA!B23)","v":""},{"$nulls":24},"# umidificatore",null,{"$f":"SUM(AR70:AR80)","v":37}]
[{"$nulls":20},"# umidificatore",null,{"$f":"SUM(AF70:AF83)","v":12},{"$nulls":11},"Code umidificatore",null,{"$f":"IF(AK84=0,\"\",LOOKUP(AK84,AI70:AI80,AJ70:AJ80))","v":"UR080HL002"},{"$f":"IF(AK84=0,\"\",IF(AK85=\"\",\"\",CONCATENATE(AK85,AL88,AL86,AL87)))","v":"UR080HL002010240"},{"$nulls":8},"# umidificatore",null,{"$f":"SUM(BF70:BF81)","v":26}]
[null,{"$f":"LINGUA!B52","v":"Number of humidifiers"},null,null,1,"(1-99)",{"$nulls":14},"Code umidificatore",null,{"$f":"IF(W85=0,\"\",LOOKUP(W85,U70:U83,V70:V83))","v":"UE065"},{"$nulls":11},"Uscite",null,{"$f":"IF(AK84=0,\"\",LOOKUP(AK84,AI70:AI80,AL70:AL80))","v":2},{"$f":"IF(LEN(AK86)=1,CONCATENATE(\"0\",AK86),CONCATENATE(AK86))","v":"02"},{"$nulls":8},"Code umidificatore",null,{"$f":"IF(AW85=0,\"\",LOOKUP(AW85,AU70:AU81,AV70:AV81))","v":"UE065"}]
[{"$nulls":20},"Uscite",null,{"$f":"IF(W85=0,\"\",LOOKUP(W85,U70:U83,X70:X83))","v":2},{"$f":"IF(LEN(W87)=1,CONCATENATE(\"0\",W87),CONCATENATE(W87))","v":"02"},{"$nulls":10},"D uscita",null,{"$f":"IF(AK84=0,\"\",LOOKUP(AK84,AI70:AI80,AM70:AM80))","v":40},{"$f":"IF(LEN(AK87)=1,CONCATENATE(\"0\",AK87),CONCATENATE(AK87))","v":"40"},{"$nulls":8},"Uscite",null,{"$f":"IF(AW85=0,\"\",LOOKUP(AW85,AU70:AU81,AX70:AX81))","v":2},{"$f":"IF(LEN(AW87)=1,CONCATENATE(\"0\",AW87),CONCATENATE(AW87))","v":"02"}]
[{"$nulls":20},"D uscita",null,{"$f":"IF(W85=0,\"\",LOOKUP(W85,U70:U83,Y70:Y83))","v":40},{"$f":"IF(LEN(W88)=1,CONCATENATE(\"0\",W88),CONCATENATE(W88))","v":"40"},{"$nulls":10},"#_umidificatori",null,{"$f":"IF(AK84=0,\"\",LOOKUP(AK84,AI70:AI80,AN70:AN80))","v":1},{"$f":"IF(LEN(AK88)=1,CONCATENATE(\"0\",AK88),CONCATENATE(AK88))","v":"01"},{"$nulls":8},"D uscita",null,{"$f":"IF(AW85=0,\"\",LOOKUP(AW85,AU70:AU81,AY70:AY81))","v":40},{"$f":"IF(LEN(AW88)=1,CONCATENATE(\"0\",AW88),CONCATENATE(AW88))","v":"40"}]
[null,{"$f":"LINGUA!B55","v":"STEP 3"},{"$nulls":18},"C'è 230 V 1p",null,{"$f":"IF(W85=0,\"\",LOOKUP(W85,U70:U83,Z70:Z83))","v":0},{"$nulls":23},"C'è 230 V 1p",null,{"$f":"IF(AW85=0,\"\",LOOKUP(AW85,AU70:AU81,AZ70:AZ81))","v":0}]
[{"$nulls":20},"C'è 400V 3p",null,{"$f":"IF(W85=0,\"\",LOOKUP(W85,U70:U82,AA70:AA82))","v":1},{"$nulls":23},"C'è 400V 3p",null,{"$f":"IF(AW85=0,\"\",LOOKUP(AW85,AU70:AU82,BA70:BA82))","v":1}]
[{"$nulls":3},{"$f":"LINGUA!C50","v":"Choice of the humidifier"},{"$nulls":16},"#_umidificatori",null,{"$f":"IF(W85=0,\"\",LOOKUP(W85,U70:U83,AB70:AB83))","v":1},{"$f":"IF(LEN(W91)=1,CONCATENATE(\"0\",W91),CONCATENATE(W91))","v":"01"},{"$nulls":22},"#_umidificatori",null,{"$f":"IF(AW85=0,\"\",LOOKUP(AW85,AU70:AU81,BB70:BB81))","v":1},{"$f":"IF(LEN(AW91)=1,CONCATENATE(\"0\",AW91),CONCATENATE(AW91))","v":"01"}]
[]
[{"$nulls":3},"UR080H",null,{"$f":"MID(D93,1,2)","v":"UR"},{"$f":"VLOOKUP(D93,AI134:AK181,3,0)","v":"heaterSteam humidifier 80 kg/h"},{"$nulls":3},"UR",{"$nulls":9},"Umidificatori UE*X possibili",{"$nulls":25},"Umidificatori UE*Y possibili"]
[{"$nulls":10},"UE",{"$nulls":9},"230 V1p",null,{"$f":"IF(W89=0,\"\",CONCATENATE(W86,\"XD000\"))","v":""},{"$f":"IF(W85=0,\"\",IF(W94=\"\",\"\",CONCATENATE(W94,X91,X87,X88)))","v":""},{"$nulls":22},"230 V1p",null,{"$f":"IF(AW89=0,\"\",CONCATENATE(AW86,\"YD000\"))","v":""},{"$f":"IF(AW85=0,\"\",IF(AW94=\"\",\"\",CONCATENATE(AW94,AX91,AX87,AX88)))","v":""}]
[{"$nulls":6},{"$f":"VALUE(MID($D$93,3,3))","v":80},{"$nulls":3},"UG",{"$nulls":9},"400 V1p",null,{"$f":"IF(W94=\"\",IF(W90=0,\"\",CONCATENATE(W86,\"XL000\")),\"\")","v":"UE065XL000"},{"$f":"IF(W85=0,\"\",IF(W95=\"\",\"\",CONCATENATE(W95,X91,X87,X88)))","v":"UE065XL000010240"},{"$nulls":22},"400 V1p",null,{"$f":"IF(AW94=\"\",IF(AW90=0,\"\",CONCATENATE(AW86,\"YL000\")),\"\")","v":"UE065YL000"},{"$f":"IF(AW85=0,\"\",IF(AW95=\"\",\"\",CONCATENATE(AW95,AX91,AX87,AX88)))","v":"UE065YL000010240"}]
[{"$nulls":3},{"$f":"LINGUA!C73","v":"Voltage specification"},null,null,{"$f":"IF($E$84>$G$95,LINGUA!$B$75,\"\")","v":""}]
[{"$nulls":34},"Tabella UR*C"]
[{"$nulls":3},"400V, 3phase",null,null,{"$f":"IF(DESIGN!AX133=1,\"\",LINGUA!C65)","v":""},{"$nulls":13},"Tabella gaSteam"]
[{"$nulls":34},"Portata minima ",null,{"$f":"W66","v":{"v":0.5,"d":"50%"}}]
[{"$nulls":20},"Portata minima ",null,{"$f":"W66","v":{"v":0.5,"d":"50%"}},{"$nulls":11},"Massimo numero umi",null,{"$f":"W67","v":1}]
[{"$nulls":3},{"$f":"LINGUA!C74","v":"Options specification"},{"$nulls":16},"Massimo numero umi",null,{"$f":"W67","v":1}]
[{"$nulls":34},"#","Code","Max","Uscite","d_uscite","#_umi","Max_flow","Min_flow","Si/No","Quale"]
[{"$nulls":3},"heaterSteam Titanium",null,null,{"$f":"IF(DESIGN!BI133=1,\"\",LINGUA!C66)","v":""},{"$nulls":13},"#","Code","Max","Uscite","d_uscite","#_umi","Max_flow","Min_flow","Si/No","Quale",{"$nulls":4},38,"UR002CD101",2,1,30,{"$f":"CEILING($E$84/AK103,1)","v":31},{"$f":"MIN(AN103,$AK$100)*AK103","v":2},{"$f":"AO103*$AK$99","v":1},{"$f":"IF(OR(AO103=$E$84,AO103>$E$84),IF(OR(AP103=$E$84,AP103<$E$84),1,0),0)","v":0},{"$f":"AQ103*AI103","v":0}]
[{"$nulls":20},46,"UG045HD003",45,2,40,{"$f":"CEILING($E$84/W104,1)","v":2},{"$f":"MIN(Z104,$W$101)*W104","v":45},{"$f":"AA104*$W$100","v":22.5},{"$f":"IF(OR(AA104=$E$84,AA104>$E$84),IF(OR(AB104=$E$84,AB104<$E$84),1,0),0)","v":0},{"$f":"AC104*U104","v":0},{"$nulls":4},{"$f":"AI103+1","v":39},"UR004CD101",4,1,30,16,{"$f":"MIN(AN104,$AK$100)*AK104","v":4},{"$f":"AO104*$AK$99","v":2},0,{"$f":"IF(SUM(AR$103:AR103)=0,AQ104,0)*AI104","v":0}]
[{"$nulls":20},{"$f":"U104+1","v":47},"UG090HD003",90,2,40,{"$f":"CEILING($E$84/W105,1)","v":1},{"$f":"MIN(Z105,$W$101)*W105","v":90},{"$f":"AA105*$W$100","v":45},{"$f":"IF(OR(AA105=$E$84,AA105>$E$84),IF(OR(AB105=$E$84,AB105<$E$84),1,0),0)","v":1},{"$f":"IF(SUM(AD$104:AD104)=0,AC105,0)*U105","v":47},{"$nulls":4},{"$f":"AI104+1","v":40},"UR006CD101",6,1,30,11,6,3,0,{"$f":"IF(SUM(AR$103:AR104)=0,AQ105,0)*AI105","v":0}]
[{"$nulls":20},{"$f":"U105+1","v":48},"UG180HD003",180,4,40,{"$f":"CEILING($E$84/W106,1)","v":1},{"$f":"MIN(Z106,$W$101)*W106","v":180},{"$f":"AA106*$W$100","v":90},{"$f":"IF(OR(AA106=$E$84,AA106>$E$84),IF(OR(AB106=$E$84,AB106<$E$84),1,0),0)","v":0},{"$f":"IF(SUM(AD$104:AD105)=0,AC106,0)*U106","v":0},{"$nulls":4},41,"UR010CL101",10,1,30,7,10,5,0,{"$f":"IF(SUM(AR$103:AR105)=0,AQ106,0)*AI106","v":0}]
[{"$nulls":34},42,"UR020CL10S",20,1,40,4,20,10,0,{"$f":"IF(SUM(AR$103:AR106)=0,AQ107,0)*AI107","v":0}]
[{"$nulls":20},"# umidificatore",null,{"$f":"SUM(AD104:AD106)","v":47},{"$nulls":11},43,"UR027CL101",27,1,40,3,27,13.5,0,{"$f":"IF(SUM(AR$103:AR107)=0,AQ108,0)*AI108","v":0}]
[{"$nulls":20},"Code umidificatore",null,{"$f":"IF(W108=0,\"\",LOOKUP(W108,U104:U106,V104:V106))","v":"UG090HD003"},{"$f":"IF(W108=0,\"\",IF(W109=\"\",\"\",CONCATENATE(W109,X112,X110,X111)))","v":"UG090HD003010240"},{"$nulls":10},44,"UR040CL101",40,1,40,2,40,20,0,{"$f":"IF(SUM(AR$103:AR108)=0,AQ109,0)*AI109","v":0}]
[{"$nulls":5},{"$f":"IF(G98<>\"\",\" \", IF(G103<>\"\",\" \",BN134))","v":"UR080HL103"},{"$nulls":14},"Uscite",null,{"$f":"IF(W108=0,\"\",LOOKUP(W108,U104:U106,X104:X106))","v":2},{"$f":"IF(LEN(W110)=1,CONCATENATE(\"0\",W110),CONCATENATE(W110))","v":"02"},{"$nulls":10},45,"UR060CL101",60,2,40,2,60,30,0,{"$f":"IF(SUM(AR$103:AR109)=0,AQ110,0)*AI110","v":0}]
[{"$nulls":20},"D uscita",null,{"$f":"IF(W108=0,\"\",LOOKUP(W108,U104:U106,Y104:Y106))","v":40},{"$f":"IF(LEN(W111)=1,CONCATENATE(\"0\",W111),CONCATENATE(W111))","v":"40"}]
[{"$nulls":20},"#_umidificatore",null,{"$f":"IF(W108=0,\"\",LOOKUP(W108,U104:U106,Z104:Z106))","v":1},{"$f":"IF(LEN(W112)=1,CONCATENATE(\"0\",W112),CONCATENATE(W112))","v":"01"}]
[null,{"$f":"LINGUA!C558","v":"STEP 4"}]
[]
[{"$nulls":3},{"$f":"LINGUA!C549","v":"Choise of the Steam Distributor (if required)"}]
[]
[{"$nulls":3},{"$f":"LINGUA!C550","v":"Steam distributor suggested automatically by the tool"}]
[]
[null,null,false,{"$f":"LINGUA!C554","v":"Steam distributor code"},null,null,{"$f":"LINGUA!B57","v":"No. of distributors in the duct"},{"$nulls":27},"# umidificatore",null,{"$f":"SUM(AR103:AR110)","v":0}]
[{"$nulls":3},{"$f":"VLOOKUP(1,DP!A2:D64,4,0)","v":"DP060D40RU"},null,null,{"$f":"VLOOKUP(1,DP!A2:N64,14,0)*E86","v":2},{"$nulls":27},"Code umidificatore",null,{"$f":"IF(AK119=0,\"\",LOOKUP(AK119,AI103:AI110,AJ103:AJ110))","v":""},{"$f":"IF(AK119=0,\"\",IF(AK120=\"\",\"\",CONCATENATE(AK120,AL123,AL121,AL122)))","v":""}]
[{"$nulls":34},"Uscite",null,{"$f":"IF(AK119=0,\"\",LOOKUP(AK119,AI103:AI110,AL103:AL110))","v":""},{"$f":"IF(LEN(AK121)=1,CONCATENATE(\"0\",AK121),CONCATENATE(AK121))","v":""}]
[{"$nulls":3},{"$f":"LINGUA!B61","v":"Humidification distance (m)"},null,null,{"$f":"LINGUA!B20","v":"Air speed"},{"$nulls":27},"D uscita",null,{"$f":"IF(AK119=0,\"\",LOOKUP(AK119,AI103:AI110,AM103:AM110))","v":""},{"$f":"IF(LEN(AK122)=1,CONCATENATE(\"0\",AK122),CONCATENATE(AK122))","v":""},{"$nulls":5},"UG230"]
[{"$nulls":3},{"$f":"'Steam absoprtion distance-AUTO'!$M$18","v":{"v":1.46,"d":"1.5"}},null,null,{"$f":"'Steam absoprtion distance-AUTO'!M15","v":{"v":2.1043771043771042,"d":"2.1"}},{"$nulls":27},"#_umidificatori",null,{"$f":"IF(AK119=0,\"\",LOOKUP(AK119,AI103:AI110,AN103:AN110))","v":""},{"$f":"IF(LEN(AK123)=1,CONCATENATE(\"0\",AK123),CONCATENATE(AK123))","v":""},{"$nulls":3},{"$f":"MID(D93,3,3)","v":"080"},null,"UE001","001;002;004;009"]
[{"$nulls":43},"UE003","003;"]
[{"$nulls":3},{"$f":"LINGUA!B59","v":"Max kg/h per distributor"},null,null,{"$f":"LINGUA!B60","v":"Distributor length (mm)"},{"$nulls":36},"UE005","005;"]
[{"$nulls":3},{"$f":"'Steam absoprtion distance-AUTO'!M9","v":45},null,null,{"$f":"'Steam absoprtion distance-AUTO'!M12","v":600},{"$nulls":36},"UE006","006;",{"$nulls":4},{"$f":"IF(F93=K95,AQ133,IF(AP123=(OR(AX134,AX160,AX161,AX138)),_UE01,IF(AP123=AX135,_UE03,IF(AP123=AX162,_UE06,IF(AP123=AX136,_UE05,IF(AP123=(OR(AX137,AX139,AX140,AX142,AX144,AX143,AX165,AX166)),_UE08,_UE18))))))","v":{"$error":"#VALUE!"}}]
[{"$nulls":20},"Stringa degli umidificatori che rispondono ai criteri",{"$nulls":6},{"$f":"CONCATENATE(X94,X95,AX94,AX95,AL85,X109)","v":"UE065XL000010240UE065YL000010240UR080HL002010240UG090HD003010240"},{"$nulls":15},"UE008","008;010;015;025;035;045;020;027"]
[{"$nulls":43},"UE018","018;065;090;130;040;060",{"$nulls":18},"Codice finale"]
[]
[{"$nulls":3},{"$f":"LINGUA!B51","v":"Y connection for steam hose"},null,null,{"$f":"LINGUA!B26","v":"Quantity"},{"$nulls":7},{"$f":"LINGUA!C559","v":"Chosen by the tool"},{"$nulls":5},"ref","Codice","#","uscite","d","#","uscite","d","ref",{"$nulls":6},"Modelli",{"$nulls":4},"Tensioni possibili ",{"$nulls":11},"Opzional possibili ",{"$nulls":14},"UR020H"]
[{"$nulls":3},{"$f":"IF(VLOOKUP(1,DP!A2:S64,19,0)<>0,VLOOKUP(1,DP!A2:S64,19,0),\" \")","v":" "},null,null,{"$f":"IF(D131=\" \",\" \",ROUNDUP(G120/2,0))","v":" "},{"$nulls":7},{"$f":"LINGUA!C560","v":"Chosen by the user"},{"$nulls":5},1,{"$f":"MID($AB$127,U131,6)","v":"UE065X"},{"$f":"VALUE(MID($AB$127,U131+10,2))","v":1},{"$f":"VALUE(MID($AB$127,U131+12,2))","v":2},{"$f":"VALUE(MID($AB$127,U131+14,2))","v":40},{"$f":"IF($V131=$D$93,W131,\"\")","v":""},{"$f":"IF($V131=$D$93,X131,\"\")","v":""},"",{"$f":"U131","v":1},{"$nulls":20},{"$f":"(VLOOKUP($D$93,$AI$134:$AJ$181,2,0)+1)","v":38},{"$nulls":10},{"$f":"(VLOOKUP($D$93,$AI$134:$AJ$181,2,0)+1)","v":38},null,null,{"$f":"D93","v":"UR080H"},{"$nulls":3},"UR020C"]
[]
[{"$nulls":20},{"$f":"U131+16","v":17},"UE065Y",1,2,40,"","","",{"$f":"U133","v":17},{"$nulls":12},"208V, 1phase","230V, 1phase","208V, 3phase","230V, 3phase","400V, 3phase","460V, 3phase","575V, 3phase","kg/h",{"$f":"HLOOKUP($D$98,$AP$133:$AV$181,AX131,0)","v":1},{"$nulls":3},{"$f":"BJ142","v":"Disposable cylinder (humiSteam only)"},{"$f":"BJ143","v":"Cleanable cylinder (humiSteam only)"},{"$f":"BJ144","v":"heaterSteam process"},{"$f":"BJ145","v":"heaterSteam Titanium"},{"$f":"BJ146","v":"Pump 50 hz (gaSteam only)"},{"$f":"BJ147","v":"Pump 60 Hz (USA Market) (gaSteam only)"}," ",{"$f":"HLOOKUP($D$103,$BA$133:$BG$181,BI131,0)","v":1},{"$nulls":4},"concatena",null,"eccezione per UR20"]
[null,null,true,{"$f":"LINGUA!C551","v":"Choice of steam distributor by the user (not automatically by the tool)"},{"$nulls":4},{"$f":"IF(G115=O131,LINGUA!C560,LINGUA!C559)","v":"Chosen by the tool"},{"$nulls":11},{"$f":"U133+16","v":33},"UR080H",1,2,40,1,2,40,33,{"$nulls":5},"UE001X",1,"humiSteam X-plus 1,5 kg/h",null,null,"UEX",1,1,1,{"$nulls":5},1.5,"001",null,"UEX",1,1,1,{"$nulls":8},{"$f":"HLOOKUP(D98,AP133:AV182,50,0)","v":"L"},null,{"$f":"CONCATENATE(BL131&BL134&BL136)","v":"UR080HL103"},null,{"$f":"CONCATENATE(BL131&BL134&BP136&BP135)","v":"UR080HL10S"}]
[{"$nulls":20},{"$f":"U134+16","v":49},"UG090H",1,2,40,"","","",49,{"$nulls":5},"UE003X",2,"humiSteam X-plus 3 kg/h",{"$nulls":3},2,1,1,1,1,1,1,null,3,"003",null,null,2,1,1,{"$nulls":12},"S"]
[{"$nulls":3},{"$f":"IF(G115=O131,LINGUA!C552,\"\")","v":""},null,null,{"$f":"IF(G115=O131,LINGUA!B57,\"\")","v":""},{"$nulls":13},{"$f":"U135+16","v":65},"",{"$error":"#VALUE!"},{"$error":"#VALUE!"},{"$error":"#VALUE!"},"","","",65,{"$nulls":5},"UE005X",3,"humiSteam X-plus 5 kg/h",{"$nulls":3},3,1,1,1,1,1,1,1,5,"005",null,null,3,1,1,{"$nulls":8},{"$f":"HLOOKUP(D103,BA133:BG182,50,0)","v":"103"},{"$nulls":3},{"$f":"MID(BL136,1,2)","v":"10"}]
[{"$nulls":3},"DP060D40RU",null,null,4,{"$nulls":13},{"$f":"U136+16","v":81},"",{"$error":"#VALUE!"},{"$error":"#VALUE!"},{"$error":"#VALUE!"},"","","",81,{"$nulls":5},"UE008X",4,"humiSteam X-plus 8 kg/h",{"$nulls":3},4,null,null,1,1,1,1,1,8,"008",null,null,4,1,1]
[{"$nulls":20},{"$f":"U137+16","v":97},"",{"$f":"VALUE(MID($AB$127,U138+10,2))","v":{"$error":"#VALUE!"}},{"$f":"VALUE(MID($AB$127,U138+12,2))","v":{"$error":"#VALUE!"}},{"$f":"VALUE(MID($AB$127,U138+14,2))","v":{"$error":"#VALUE!"}},"","","",97,{"$nulls":5},"UE009X",5,"humiSteam X-plus 9 kg/h",{"$nulls":3},5,1,1,{"$nulls":5},9,"009",null,null,5,1,1]
[{"$nulls":3},{"$f":"IF(G115=O131,LINGUA!C61,\"\")","v":""},null,null,{"$f":"IF(G115=O131,LINGUA!B50,\"\")","v":""},{"$nulls":18},{"$f":"SUM(Z131:Z138)","v":1},{"$f":"SUM(AA131:AA138)","v":2},{"$f":"SUM(AB131:AB138)","v":40},{"$nulls":6},"UE010X",6,"humiSteam X-plus 10 kg/h",{"$nulls":3},6,null,null,1,1,1,1,1,10,"010",null,null,6,1,1]
[{"$nulls":3},{"$f":"'Steam absoprtion distance '!M18","v":{"v":0.61,"d":"0.6"}},null,null,{"$f":"'Steam absoprtion distance '!M15","v":{"v":2.1043771043771042,"d":"2.1"}},{"$nulls":27},"UE015X",7,"humiSteam X-plus 15 kg/h",{"$nulls":3},7,null,null,1,1,1,1,1,15,"015",null,null,7,1,1]
[{"$nulls":34},"UE018X",8,"humiSteam X-plus 18 kg/h",{"$nulls":3},8,{"$nulls":4},1,1,1,18,"018",null,null,8,1,1]
[{"$nulls":3},{"$f":"IF(G115=O131,LINGUA!C59,\"\")","v":""},null,null,{"$f":"IF(G115=O131,LINGUA!B60,\"\")","v":""},{"$nulls":13},"Tabella tubi trasporto vapore",{"$nulls":5},"Possible solutions",{"$nulls":7},"UE025X",9,"humiSteam X-plus 25 kg/h",{"$nulls":3},9,null,null,1,1,1,1,1,25,"025",null,null,9,1,1,{"$nulls":6},{"$f":"LINGUA!C67","v":"Disposable cylinder (humiSteam only)"}]
[{"$nulls":3},{"$f":"'Steam absoprtion distance '!M9","v":25},null,null,{"$f":"'Steam absoprtion distance '!M12","v":834},{"$nulls":13},"ref","Code","D","Si/no",{"$nulls":10},"UE035X",10,"humiSteam X-plus 35 kg/h",{"$nulls":3},10,null,null,1,1,1,1,1,35,"035",null,null,10,1,1,{"$nulls":6},{"$f":"LINGUA!C68","v":"Cleanable cylinder (humiSteam only)"}]
[{"$nulls":20},1,"1312360AXX",22,{"$f":"IF(W144=$AB$139,U144,\"\")","v":""},null,null,{"$f":"LINGUA!B49","v":"Humidifier code"},null,{"$f":"LINGUA!B26","v":"Quantity"},{"$nulls":5},"UE045X",11,"humiSteam X-plus 45 kg/h",{"$nulls":3},11,null,null,1,1,1,1,1,45,"045",null,null,11,1,1,{"$nulls":6},{"$f":"LINGUA!C69","v":"heaterSteam process"}]
[{"$nulls":3},{"$f":"IF(G115=O131,LINGUA!B51,\"\")","v":""},null,null,{"$f":"IF(G115=O131,LINGUA!B26,\"\")","v":""},{"$nulls":13},{"$f":"U144+1","v":2},"1312365AXX",30,{"$f":"IF(W145=$AB$139,U145,\"\")","v":""},null,null,{"$f":"IF(V131=\"\",\"\",V131)","v":"UE065X"},null,{"$f":"IF(AA145=\"\",\"\",W131)","v":1},{"$nulls":5},"UE065X",12,"humiSteam X-plus 65 kg/h",{"$nulls":3},12,{"$nulls":4},1,1,1,65,"065",null,null,12,1,1,{"$nulls":6},{"$f":"LINGUA!C70","v":"heaterSteam Titanium"}]
[{"$nulls":3},"UEKY000000",null,null,1,{"$nulls":13},{"$f":"U145+1","v":3},"1312367AXX",40,{"$f":"IF(W146=$AB$139,U146,\"\")","v":3},null,null,{"$f":"IF(V133=\"\",\"\",V133)","v":"UE065Y"},null,{"$f":"IF(AA146=\"\",\"\",W133)","v":1},{"$nulls":5},"UE090X",13,"humiSteam X-plus 90 kg/h",{"$nulls":3},13,{"$nulls":4},1,1,1,90,"090",null,null,13,1,1,{"$nulls":6},{"$f":"LINGUA!C71","v":"Pump 50 hz (gaSteam only)"}]
[{"$nulls":3},{"$f":"CONCATENATE(CODICI!B30, \": \",CODICI!C30)","v":"UEKY000000: ‘Y’ connector for steam hoses (from 1x Ø=40 mm to 2x Ø=30 mm)"},{"$nulls":22},"UR080H",null,1,{"$nulls":5},"UE130X",14,"humiSteam X-plus 130 kg/h",{"$nulls":3},14,{"$nulls":4},1,1,1,130,"013",null,null,14,1,1,{"$nulls":6},{"$f":"LINGUA!C72","v":"Pump 60 Hz (USA Market) (gaSteam only)"}]
[{"$nulls":3},{"$f":"CONCATENATE(CODICI!B31, \": \",CODICI!C31)","v":"UEKY40X400: ‘Y’ connector for steam hoses (from 1x Ø=40 mm to 2x Ø=40 mm)"},{"$nulls":16},"Codice",{"$f":"IF(AB127=\"\",\"\",LOOKUP(SUM(X144:X146),U144:U146,V144:V146))","v":"1312367AXX"},{"$nulls":4},"UG090H",null,1,{"$nulls":5},"UE001Y",15,"humiSteam Basic 1,5 kg/h",null,null,"UEY",15,1,1,{"$nulls":5},1.5,null,null,"UEY",15,1,1]
[{"$nulls":3},{"$f":"LINGUA!C555","v":"(1)\"Special application\" DP code included"},{"$nulls":22},"",null,"",{"$nulls":5},"UE003Y",16,"humiSteam Basic 3 kg/h",{"$nulls":3},16,1,1,1,1,1,1,null,3,{"$nulls":3},16,1,1]
[{"$nulls":3},{"$f":"IF(G115=O131,'Steam absoprtion distance '!D28,\"\")","v":""},{"$f":"IF(G115=O131,'Steam absoprtion distance '!G28,\"\")","v":""},{"$nulls":15},"Tubo scarico condensa",{"$nulls":5},"",null,"",{"$nulls":5},"UE005Y",17,"humiSteam Basic 5 kg/h",{"$nulls":3},17,1,1,1,1,1,1,1,5,{"$nulls":3},17,1,1]
[{"$nulls":4},{"$f":"IF(G115=O131,'Steam absoprtion distance '!G29,\"\")","v":""},{"$nulls":21},"",null,"",{"$nulls":5},"UE008Y",18,"humiSteam Basic 8 kg/h",{"$nulls":3},18,null,null,1,1,1,1,1,8,{"$nulls":3},18,1,1]
[{"$nulls":4},{"$f":"IF(G115=O131,'Steam absoprtion distance '!G30,\"\")","v":""},{"$nulls":15},"Modello TUBO",null,"1312368AXX",{"$nulls":11},"UE009Y",19,"humiSteam Basic 9 kg/h",{"$nulls":3},19,1,1,{"$nulls":5},9,{"$nulls":3},19,1,1]
[{"$nulls":34},"UE010Y",20,"humiSteam Basic 10 kg/h",{"$nulls":3},20,null,null,1,1,1,1,1,10,{"$nulls":3},20,1,1]
[{"$nulls":34},"UE015Y",21,"humiSteam Basic 15 kg/h",{"$nulls":3},21,null,null,1,1,1,1,1,15,{"$nulls":3},21,1,1]
[{"$nulls":3},{"$f":"LINGUA!B56","v":"Go to the \"Selection\" sheet"},{"$nulls":16},"Sonde possibili",{"$nulls":13},"UE018Y",22,"humiSteam Basic 18 kg/h",{"$nulls":3},22,{"$nulls":4},1,1,1,18,{"$nulls":3},22,1,1]
[{"$nulls":34},"UE025Y",23,"humiSteam Basic 25 kg/h",{"$nulls":3},23,null,null,1,1,1,1,1,25,{"$nulls":3},23,1,1]
[{"$nulls":20},"DPWC112000",{"$nulls":13},"UE035Y",24,"humiSteam Basic 35 kg/h",{"$nulls":3},24,null,null,1,1,1,1,1,35,{"$nulls":3},24,1,1]
[{"$nulls":10},"DP085D22R0",{"$nulls":9},"DPPC112000",{"$nulls":13},"UE045Y",25,"humiSteam Basic 45 kg/h",{"$nulls":3},25,null,null,1,1,1,1,1,45,{"$nulls":3},25,1,1]
[{"$nulls":10},"DP060D22R0",{"$nulls":9},"DPPC212000",{"$nulls":13},"UE065Y",26,"humiSteam Basic 65 kg/h",{"$nulls":3},26,{"$nulls":4},1,1,1,65,{"$nulls":3},26,1,1]
[{"$nulls":10},"DP045D22R0",{"$nulls":9},"DPDC112000",{"$nulls":13},"UR002H",27,"heaterSteam humidifier 2 kg/h",null,null,"URH",27,null,1,{"$nulls":5},2,"002",null,"UR",27,null,null,1,1]
[{"$nulls":10},"DP035D22R0",{"$nulls":9},"DPDC212000",{"$nulls":13},"UR004H",28,"heaterSteam humidifier 4 kg/h",{"$nulls":3},28,null,1,{"$nulls":5},4,"004",null,null,28,null,null,1,1]
[{"$nulls":10},"DP165D30R0",{"$nulls":9},"ASET030001",{"$nulls":13},"UR006H",29,"heaterSteam humidifier 6 kg/h",{"$nulls":3},29,null,1,null,1,1,null,null,6,"006",null,null,29,null,null,1,1]
[{"$nulls":10},"DP125D30R0",{"$nulls":23},"UR010H",30,"heaterSteam humidifier 10 kg/h",{"$nulls":3},30,{"$nulls":3},1,1,1,null,10,"010",null,null,30,null,null,1,1]
[{"$nulls":10},"DP105D30R0",{"$nulls":23},"UR013H",31,"heaterSteam humidifier 13 kg/h",{"$nulls":3},31,{"$nulls":3},1,1,1,null,13,"013",null,null,31,null,null,1,1]
[{"$nulls":10},"DP085D30R0",{"$nulls":23},"UR020H",32,"heaterSteam humidifier 20 kg/h",{"$nulls":3},32,{"$nulls":3},1,1,1,null,20,"020",null,null,32,null,null,1,1]
[{"$nulls":10},"DP060D30R0",{"$nulls":23},"UR027H",33,"heaterSteam humidifier 27 kg/h",{"$nulls":3},33,{"$nulls":3},1,1,1,null,27,"027",null,null,33,null,null,1,1]
[{"$nulls":10},"DP045D30R0",{"$nulls":23},"UR040H",34,"heaterSteam humidifier 40 kg/h",{"$nulls":3},34,{"$nulls":4},1,1,null,40,"040",null,null,34,null,null,1,1]
[{"$nulls":10},"DP035D30R0",{"$nulls":23},"UR053H",35,"heaterSteam humidifier 53 kg/h",{"$nulls":3},35,{"$nulls":4},1,1,null,53,"053",null,null,35,null,null,1,1]
[{"$nulls":10},"DP205D40R0",{"$nulls":23},"UR060H",36,"heaterSteam humidifier 60 kg/h",{"$nulls":3},36,{"$nulls":4},1,1,null,60,"060",null,null,36,null,null,1,1]
[{"$nulls":10},"DP165D40R0",{"$nulls":23},"UR080H",37,"heaterSteam humidifier 80 kg/h",{"$nulls":3},37,{"$nulls":4},1,1,null,80,"080",null,null,37,null,null,1,1]
[{"$nulls":10},"DP125D40R0",{"$nulls":23},"UR002C",38,"heaterSteam C-control 2 kg/h",null,null,"URC",38,1,1,{"$nulls":5},2,null,null,"UR",38,null,null,1,1]
[{"$nulls":10},"DP105D40R0",{"$nulls":23},"UR004C",39,"heaterSteam C-control 4 kg/h",{"$nulls":3},39,1,1,{"$nulls":5},4,{"$nulls":3},39,null,null,1,1]
[{"$nulls":10},"DP085D40R0",{"$nulls":23},"UR006C",40,"heaterSteam C-control 6 kg/h",{"$nulls":3},40,1,1,1,1,1,1,1,6,{"$nulls":3},40,null,null,1,1]
[{"$nulls":10},"DP060D40RU",{"$nulls":23},"UR010C",41,"heaterSteam C-control 10 kg/h",{"$nulls":3},41,null,null,1,1,1,1,1,10,{"$nulls":3},41,null,null,1,1]
[{"$nulls":10},"DP060D30RU",{"$nulls":23},"UR020C",42,"heaterSteam C-control 20 kg/h",{"$nulls":3},42,null,null,1,1,1,1,1,20,{"$nulls":3},42,null,null,1,1]
[{"$nulls":10},"DP045D30RU",{"$nulls":23},"UR027C",43,"heaterSteam C-control 27 kg/h",{"$nulls":3},43,null,null,1,1,1,1,1,27,{"$nulls":3},43,null,null,1,1]
[{"$nulls":10},"DP030D30RU",{"$nulls":23},"UR040C",44,"heaterSteam C-control 40 kg/h",{"$nulls":3},44,{"$nulls":4},1,1,1,40,{"$nulls":3},44,null,null,1,1]
[{"$nulls":10},"DP030D22RU",{"$nulls":23},"UR060C",45,"heaterSteam C-control 60 kg/h",{"$nulls":3},45,{"$nulls":4},1,1,1,60,{"$nulls":3},45,null,null,1,1]
[{"$nulls":34},"UG045H",46,"gaSteam 45 kg/h",null,null,"UG",46,null,1,{"$nulls":5},45,null,null,"UG",46,{"$nulls":4},1,1]
[{"$nulls":34},"UG090H",47,"gaSteam 90 kg/h",{"$nulls":3},47,null,1,{"$nulls":5},90,{"$nulls":3},47,{"$nulls":4},1,1]
[{"$nulls":34},"UG180H",48,"gaSteam 180 kg/h",{"$nulls":3},48,null,1,{"$nulls":5},180,{"$nulls":3},48,{"$nulls":4},1,1]
[{"$nulls":41},"U","D","W","K","L","M","N",{"$nulls":5},"001","C01","003","103","003","103"]
[{"$nulls":20},"Tabella distributori DP",{"$f":"MID(D93,1,5)","v":"UR080"}]
[{"$nulls":20},"BASE"]
[{"$nulls":20},"Codice/ descrizione","DP030D22RU","DP035D22R0","DP045D22R0","DP060D22R0","DP085D22R0","DP030D30RU","DP035D30R0","DP045D30R0","DP045D30RU","DP060D30R0","DP060D30RU","DP085D30R0","DP105D30R0","DP125D30R0","DP165D30R0","DP060D40RU","DP085D40R0","DP105D40R0","DP125D40R0","DP165D40R0","DP205D40R0","Quale umidificatore",{"$f":"V185","v":"DP030D22RU"},"DP035D22R0","DP045D22R0","DP060D22R0","DP085D22R0","DP030D30RU","DP035D30R0","DP045D30R0","DP045D30RU","DP060D30R0","DP060D30RU",{"$f":"AG185","v":"DP085D30R0"},{"$f":"AH185","v":"DP105D30R0"},{"$f":"AI185","v":"DP125D30R0"},{"$f":"AJ185","v":"DP165D30R0"},null,{"$f":"AK185","v":"DP060D40RU"},"DP085D40R0","DP105D40R0","DP125D40R0","DP165D40R0","DP205D40R0"]
[{"$nulls":20},"d ingresso (C) mm",22,{"$nulls":4},30,{"$nulls":9},40,{"$nulls":6},1,{"$f":"AR186+1","v":2},{"$f":"AS186+1","v":3},4,5,6,7,8,9,10,11,12,13,14,15,null,{"$f":"BF186+1","v":16},17,18,19,20,21]
[{"$nulls":20},"sezione (B) mm",35,{"$nulls":4},45,{"$nulls":9},60]
[{"$nulls":20},"lunghezza (A) mm",300,350,450,600,850,300,350,450,450,600,600,850,1050,1250,1650,600,850,1050,1250,1650,2050,null,{"$f":"IF(V188>$E75,0,1)","v":1},1,1,1,1,1,1,1,1,1,1,1,1,0,0,null,{"$f":"IF(AK188>$E75,0,1)","v":1},1,1,0,0,0]
[{"$nulls":20},"UE001",1,1,1,1,1,{"$nulls":16},{"$f":"IF(U189=$V$183,1,0)","v":0},{"$f":"IF($AQ189=0,\"\",IF(AND(AR$188=1,V189>0),V189,\"\"))","v":""},{"$f":"IF($AQ189=0,\"\",IF(AND(AS$188=1,W189>0),W189,\"\"))","v":""},{"$f":"IF($AQ189=0,\"\",IF(AND(AT$188=1,X189>0),X189,\"\"))","v":""},{"$f":"IF($AQ189=0,\"\",IF(AND(AU$188=1,Y189>0),Y189,\"\"))","v":""},{"$f":"IF($AQ189=0,\"\",IF(AND(AV$188=1,Z189>0),Z189,\"\"))","v":""},{"$f":"IF($AQ189=0,\"\",IF(AND(AW$188=1,AA189>0),AA189,\"\"))","v":""},{"$f":"IF($AQ189=0,\"\",IF(AND(AX$188=1,AB189>0),AB189,\"\"))","v":""},{"$f":"IF($AQ189=0,\"\",IF(AND(AY$188=1,AC189>0),AC189,\"\"))","v":""},{"$f":"IF($AQ189=0,\"\",IF(AND(AZ$188=1,AD189>0),AD189,\"\"))","v":""},{"$f":"IF($AQ189=0,\"\",IF(AND(BA$188=1,AE189>0),AE189,\"\"))","v":""},{"$f":"IF($AQ189=0,\"\",IF(AND(BB$188=1,AF189>0),AF189,\"\"))","v":""},{"$f":"IF($AQ189=0,\"\",IF(AND(BC$188=1,AG189>0),AG189,\"\"))","v":""},{"$f":"IF($AQ189=0,\"\",IF(AND(BD$188=1,AH189>0),AH189,\"\"))","v":""},{"$f":"IF($AQ189=0,\"\",IF(AND(BE$188=1,AI189>0),AI189,\"\"))","v":""},{"$f":"IF($AQ189=0,\"\",IF(AND(BF$188=1,AJ189>0),AJ189,\"\"))","v":""},null,{"$f":"IF($AQ189=0,\"\",IF(AND(BH$188=1,AK189>0),AK189,\"\"))","v":""},{"$f":"IF($AQ189=0,\"\",IF(AND(BI$188=1,AL189>0),AL189,\"\"))","v":""},{"$f":"IF($AQ189=0,\"\",IF(AND(BJ$188=1,AM189>0),AM189,\"\"))","v":""},{"$f":"IF($AQ189=0,\"\",IF(AND(BK$188=1,AN189>0),AN189,\"\"))","v":""},{"$f":"IF($AQ189=0,\"\",IF(AND(BL$188=1,AO189>0),AO189,\"\"))","v":""},{"$f":"IF($AQ189=0,\"\",IF(AND(BM$188=1,AP189>0),AP189,\"\"))","v":""}]
[{"$nulls":20},"UE003",1,1,1,1,1,{"$nulls":16},{"$f":"IF(U190=$V$183,1,0)","v":0},"","","","","","","","","","","","","","","",null,"","","","","",""]
[{"$nulls":20},"UE005",{"$nulls":5},1,1,1,1,1,1,{"$nulls":10},0,"","","","","","","","","","","","","","","",null,"","","","","",""]
[{"$nulls":20},"UE008",{"$nulls":5},1,null,1,1,1,1,1,{"$nulls":9},0,"","","","","","","","","","","","","","","",null,"","","","","",""]
[{"$nulls":20},"UE009",{"$nulls":5},1,null,null,1,1,1,1,{"$nulls":9},0,"","","","","","","","","","","","","","","",null,"","","","","",""]
[{"$nulls":20},"UE010",{"$nulls":5},1,null,null,1,1,1,1,1,{"$nulls":8},0,"","","","","","","","","","","","","","","",null,"","","","","",""]
[{"$nulls":20},"UE015",{"$nulls":10},1,1,1,1,1,{"$nulls":6},0,"","","","","","","","","","","","","","","",null,"","","","","",""]
[{"$nulls":20},"UE018",{"$nulls":11},1,1,1,1,{"$nulls":6},{"$f":"IF(U196=$V$183,1,0)","v":0},{"$f":"IF($AQ196=0,\"\",IF(AND(AR$188=1,V196>0),V196,\"\"))","v":""},"","","","","","","","","","",{"$f":"IF($AQ196=0,\"\",IF(AND(BC$188=1,AG196>0),AG196,\"\"))","v":""},"","","",null,{"$f":"IF($AQ196=0,\"\",IF(AND(BH$188=1,AK196>0),AK196,\"\"))","v":""},"","","","",""]
[{"$nulls":20},"UE025",{"$nulls":15},1,1,1,{"$nulls":3},0,"","","","","","","","","","","","","","","",null,"","","","","",""]
[{"$nulls":20},"UE035",{"$nulls":15},1,null,1,1,null,null,0,"","","","","","","","","","","","","","","",null,"","","","","",""]
[{"$nulls":20},"UE045",{"$nulls":15},1,null,null,1,1,1,0,"","","","","","","","","","","","","","","",null,"","","","","",""]
[{"$nulls":20},"UE065",{"$nulls":15},2,null,2,2,2,null,0,"","","","","","","","","","","","","","","",null,"","","","","",""]
[{"$nulls":20},"UE090",{"$nulls":15},2,null,null,2,2,2,0,"","","","","","","","","","","","","","","",null,"","","","","",""]
[{"$nulls":20},"UE130",{"$nulls":15},4,null,null,4,4,4,0,"","","","","","","","","","","","","","","",null,"","","","","",""]
[{"$nulls":20},"UR002",{"$nulls":5},1,1,1,1,{"$nulls":12},0,"","","","","","","","","","","","","","","",null,"","","","","",""]
[{"$nulls":20},"UR004",{"$nulls":5},1,1,1,1,1,1,{"$nulls":10},0,"","","","","","","","","","","","","","","",null,"","","","","",""]
[{"$nulls":20},"UR006",{"$nulls":7},1,1,1,1,1,{"$nulls":9},0,"","","","","","","","","","","","","","","",null,"","","","","",""]
[{"$nulls":20},"UR010",{"$nulls":8},1,1,1,1,1,{"$nulls":8},0,"","","","","","","","","","","","","","","",null,"","","","","",""]
[{"$nulls":20},"UR013",{"$nulls":8},1,1,1,1,1,1,{"$nulls":7},0,{"$f":"IF($AQ207=0,\"\",IF(AND(AR$188=1,V207>0),V207,\"\"))","v":""},{"$f":"IF($AQ207=0,\"\",IF(AND(AS$188=1,W207>0),W207,\"\"))","v":""},{"$f":"IF($AQ207=0,\"\",IF(AND(AT$188=1,X207>0),X207,\"\"))","v":""},{"$f":"IF($AQ207=0,\"\",IF(AND(AU$188=1,Y207>0),Y207,\"\"))","v":""},{"$f":"IF($AQ207=0,\"\",IF(AND(AV$188=1,Z207>0),Z207,\"\"))","v":""},{"$f":"IF($AQ207=0,\"\",IF(AND(AW$188=1,AA207>0),AA207,\"\"))","v":""},{"$f":"IF($AQ207=0,\"\",IF(AND(AX$188=1,AB207>0),AB207,\"\"))","v":""},{"$f":"IF($AQ207=0,\"\",IF(AND(AY$188=1,AC207>0),AC207,\"\"))","v":""},{"$f":"IF($AQ207=0,\"\",IF(AND(AZ$188=1,AD207>0),AD207,\"\"))","v":""},{"$f":"IF($AQ207=0,\"\",IF(AND(BA$188=1,AE207>0),AE207,\"\"))","v":""},{"$f":"IF($AQ207=0,\"\",IF(AND(BB$188=1,AF207>0),AF207,\"\"))","v":""},{"$f":"IF($AQ207=0,\"\",IF(AND(BC$188=1,AG207>0),AG207,\"\"))","v":""},{"$f":"IF($AQ207=0,\"\",IF(AND(BD$188=1,AH207>0),AH207,\"\"))","v":""},{"$f":"IF($AQ207=0,\"\",IF(AND(BE$188=1,AI207>0),AI207,\"\"))","v":""},{"$f":"IF($AQ207=0,\"\",IF(AND(BF$188=1,AJ207>0),AJ207,\"\"))","v":""},null,{"$f":"IF($AQ207=0,\"\",IF(AND(BH$188=1,AK207>0),AK207,\"\"))","v":""},{"$f":"IF($AQ207=0,\"\",IF(AND(BI$188=1,AL207>0),AL207,\"\"))","v":""},{"$f":"IF($AQ207=0,\"\",IF(AND(BJ$188=1,AM207>0),AM207,\"\"))","v":""},{"$f":"IF($AQ207=0,\"\",IF(AND(BK$188=1,AN207>0),AN207,\"\"))","v":""},{"$f":"IF($AQ207=0,\"\",IF(AND(BL$188=1,AO207>0),AO207,\"\"))","v":""},{"$f":"IF($AQ207=0,\"\",IF(AND(BM$188=1,AP207>0),AP207,\"\"))","v":""}]
[{"$nulls":20},"UR020",{"$nulls":15},1,1,1,1,null,null,0,"","","","","","","","","","","","","","","",null,"","","","","",""]
[{"$nulls":20},"UR027",{"$nulls":15},1,1,1,1,null,null,0,"","","","","","","","","","","","","","","",null,"","","","","",""]
[{"$nulls":20},"UR040",{"$nulls":15},1,null,1,1,1,null,0,"","","","","","","","","","","","","","","",null,"","","","","",""]
[{"$nulls":20},"UR053",{"$nulls":15},2,2,2,2,2,2,0,{"$f":"IF($AQ211=0,\"\",IF(AND(AR$188=1,V211>0),V211,\"\"))","v":""},"","","","","","","","","","","","","","",null,{"$f":"IF($AQ211=0,\"\",IF(AND(BH$188=1,AK211>0),AK211,\"\"))","v":""},"","","","",""]
[{"$nulls":20},"UR060",{"$nulls":15},2,null,2,2,2,null,0,"","","","","","","","","","","","","","","",null,"","","","","",""]
[{"$nulls":20},"UR080",{"$nulls":15},2,null,null,2,2,2,1,{"$f":"IF($AQ213=0,\"\",IF(AND(AR$188=1,V213>0),V213,\"\"))","v":""},"","","","","","","","","","","","","","",null,{"$f":"IF($AQ213=0,\"\",IF(AND(BH$188=1,AK213>0),AK213,\"\"))","v":2},"","","","",""]
[{"$nulls":20},"UG045",{"$nulls":15},2,2,2,2,2,null,0,"","","","","","","","","","","","","","","",null,"","","","","",""]
[{"$nulls":20},"UG090",{"$nulls":15},2,null,null,2,2,2,0,"","","","","","","","","","","","","","","",null,"","","","","",""]
[{"$nulls":20},"UG180",{"$nulls":15},4,null,null,4,4,4,0,"","","","","","","","","","","","","","","",null,"","","","","",""]
[{"$nulls":43},{"$f":"IF(SUM(AS217:$BM$217)=0,SUM(AR189:AR216),0)","v":0},{"$f":"IF(SUM(AT217:$BM$217)=0,SUM(AS189:AS216),0)","v":0},{"$f":"IF(SUM(AU217:$BM$217)=0,SUM(AT189:AT216),0)","v":0},{"$f":"IF(SUM(AV217:$BM$217)=0,SUM(AU189:AU216),0)","v":0},{"$f":"IF(SUM(AW217:$BM$217)=0,SUM(AV189:AV216),0)","v":0},{"$f":"IF(SUM(AX217:$BM$217)=0,SUM(AW189:AW216),0)","v":0},{"$f":"IF(SUM(AY217:$BM$217)=0,SUM(AX189:AX216),0)","v":0},{"$f":"IF(SUM(AZ217:$BM$217)=0,SUM(AY189:AY216),0)","v":0},{"$f":"IF(SUM(BA217:$BM$217)=0,SUM(AZ189:AZ216),0)","v":0},{"$f":"IF(SUM(BB217:$BM$217)=0,SUM(BA189:BA216),0)","v":0},{"$f":"IF(SUM(BC217:$BM$217)=0,SUM(BB189:BB216),0)","v":0},{"$f":"IF(SUM(BD217:$BM$217)=0,SUM(BC189:BC216),0)","v":0},{"$f":"IF(SUM(BE217:$BM$217)=0,SUM(BD189:BD216),0)","v":0},{"$f":"IF(SUM(BF217:$BM$217)=0,SUM(BE189:BE216),0)","v":0},{"$f":"IF(SUM(BH217:$BM$217)=0,SUM(BF189:BF216),0)","v":0},null,{"$f":"IF(SUM(BI217:$BM$217)=0,SUM(BH189:BH216),0)","v":2},{"$f":"IF(SUM(BJ217:$BM$217)=0,SUM(BI189:BI216),0)","v":0},{"$f":"IF(SUM(BK217:$BM$217)=0,SUM(BJ189:BJ216),0)","v":0},{"$f":"IF(SUM(BL217:$BM$217)=0,SUM(BK189:BK216),0)","v":0},{"$f":"IF(SUM(BM217:$BM$217)=0,SUM(BL189:BL216),0)","v":0},{"$f":"SUM(BM189:BM216)","v":0}]
[{"$nulls":20},"Numero DP",{"$f":"SUM(AR217:BM217)","v":2},{"$nulls":21},{"$f":"IF(AR217=0,0,AR186)","v":0},0,0,0,0,0,0,0,0,0,0,0,0,0,0,null,16,0,0,0,0,0]
[{"$nulls":20},"Tipo DP",{"$f":"IF(V218=0,\"\",LOOKUP(SUM(AR218:BM218),AR186:BM186,AR185:BM185))","v":"DP060D40RU"}]
[]
[{"$nulls":20},"Alternativa",{"$nulls":40},{"$f":"IF(AND(BJ$188=1,AM221>0),AM221,\"\")","v":""},{"$f":"IF(AND(BK$188=1,AN221>0),AN221,\"\")","v":""},{"$f":"IF(AND(BL$188=1,AO221>0),AO221,\"\")","v":""},{"$f":"IF(AND(BM$188=1,AP221>0),AP221,\"\")","v":""}]
[{"$nulls":20},"Codice/ descrizione","DP030D22RU","DP035D22R0","DP045D22R0","DP060D22R0","DP085D22R0","DP030D30RU","DP035D30R0","DP045D30R0","DP045D30RU","DP060D30R0","DP060D30RU","DP085D30R0","DP105D30R0","DP125D30R0","DP165D30R0","DP060D40RU","DP085D40R0","DP105D40R0","DP125D40R0","DP165D40R0","DP205D40R0",null,{"$f":"V222","v":"DP030D22RU"},"DP035D22R0","DP045D22R0","DP060D22R0","DP085D22R0","DP030D30RU","DP035D30R0","DP045D30R0","DP045D30RU","DP060D30R0","DP060D30RU",{"$f":"AG222","v":"DP085D30R0"},{"$f":"AH222","v":"DP105D30R0"},{"$f":"AI222","v":"DP125D30R0"},{"$f":"AJ222","v":"DP165D30R0"},null,{"$f":"AK222","v":"DP060D40RU"},"DP085D40R0","DP105D40R0","DP125D40R0","DP165D40R0","DP205D40R0",{"$nulls":22},{"$f":"MID(SELECTION!B7,1,5)","v":"UR080"},{"$f":"VLOOKUP(CJ222,BP229:CL257,23,0)","v":1}]
[{"$nulls":20},"d ingresso (C) mm",22,22,22,22,22,30,30,30,30,30,30,30,30,30,30,40,40,40,40,40,40,null,1,{"$f":"AR223+1","v":2},{"$f":"AS223+1","v":3},4,5,6,7,8,9,10,11,12,13,14,15,null,{"$f":"BF223+1","v":16},17,18,19,20,21,{"$nulls":70},{"$f":"VLOOKUP(CJ222,DJ225:EF257,23,0)","v":4}]
[{"$nulls":20},"sezione (B) mm",35,{"$nulls":4},45,{"$nulls":9},60,{"$nulls":6},{"$f":"V223","v":22},22,22,22,22,30,30,30,30,30,30,{"$f":"AG223","v":30},{"$f":"AH223","v":30},{"$f":"AI223","v":30},{"$f":"AJ223","v":30},null,{"$f":"AK223","v":40},40,40,40,40,40]
[{"$nulls":20},"lunghezza (A) mm",300,350,450,600,850,300,350,450,450,600,600,850,1050,1250,1650,600,850,1050,1250,1650,2050,null,{"$f":"AR188","v":1},{"$f":"AS188","v":1},1,1,1,1,1,1,1,1,1,1,1,0,0,null,1,1,1,0,0,0,null,null,"Codice/ descrizione","DP030D30RU","DP035D30R0","DP045D30R0","DP045D30RU","DP060D30R0","DP060D30RU","DP085D30R0","DP105D30R0","DP125D30R0","DP165D30R0","DP060D40RU","DP085D40R0","DP105D40R0","DP125D40R0","DP165D40R0","DP205D40R0","DP030D22RU","DP035D22R0","DP045D22R0","DP060D22R0","DP085D22R0",null,"Codice/ descrizione","DP030D30RU","DP035D30R0","DP045D30R0","DP045D30RU","DP060D30R0","DP060D30RU","DP085D30R0","DP105D30R0","DP125D30R0","DP165D30R0","DP060D40RU","DP085D40R0","DP105D40R0","DP125D40R0","DP165D40R0","DP205D40R0","DP030D22RU","DP035D22R0","DP045D22R0","DP060D22R0","DP085D22R0",null,"Codice/ descrizione","DP030D30RU","DP035D30R0","DP045D30R0","DP045D30RU","DP060D30R0","DP060D30RU","DP085D30R0","DP105D30R0","DP125D30R0","DP165D30R0","DP060D40RU","DP085D40R0","DP105D40R0","DP125D40R0","DP165D40R0","DP205D40R0","DP030D22RU","DP035D22R0","DP045D22R0","DP060D22R0","DP085D22R0"]
[{"$nulls":20},"UE001",{"$nulls":21},{"$f":"IF(U226=$V$183,1,0)","v":0},{"$f":"IF($AQ226=0,\"\",IF(AND(AR$225=1,V226>0),V226,\"\"))","v":""},{"$f":"IF($AQ226=0,\"\",IF(AND(AS$225=1,W226>0),W226,\"\"))","v":""},{"$f":"IF($AQ226=0,\"\",IF(AND(AT$225=1,X226>0),X226,\"\"))","v":""},{"$f":"IF($AQ226=0,\"\",IF(AND(AU$225=1,Y226>0),Y226,\"\"))","v":""},{"$f":"IF($AQ226=0,\"\",IF(AND(AV$225=1,Z226>0),Z226,\"\"))","v":""},{"$f":"IF($AQ226=0,\"\",IF(AND(AW$225=1,AA226>0),AA226,\"\"))","v":""},{"$f":"IF($AQ226=0,\"\",IF(AND(AX$225=1,AB226>0),AB226,\"\"))","v":""},{"$f":"IF($AQ226=0,\"\",IF(AND(AY$225=1,AC226>0),AC226,\"\"))","v":""},{"$f":"IF($AQ226=0,\"\",IF(AND(AZ$225=1,AD226>0),AD226,\"\"))","v":""},{"$f":"IF($AQ226=0,\"\",IF(AND(BA$225=1,AE226>0),AE226,\"\"))","v":""},{"$f":"IF($AQ226=0,\"\",IF(AND(BB$225=1,AF226>0),AF226,\"\"))","v":""},{"$f":"IF($AQ226=0,\"\",IF(AND(BC$225=1,AG226>0),AG226,\"\"))","v":""},"","","",null,{"$f":"IF($AQ226=0,\"\",IF(AND(BH$225=1,AK226>0),AK226,\"\"))","v":""},{"$f":"IF($AQ226=0,\"\",IF(AND(BI$225=1,AL226>0),AL226,\"\"))","v":""},{"$f":"IF($AQ226=0,\"\",IF(AND(BJ$225=1,AM226>0),AM226,\"\"))","v":""},{"$f":"IF($AQ226=0,\"\",IF(AND(BK$225=1,AN226>0),AN226,\"\"))","v":""},{"$f":"IF($AQ226=0,\"\",IF(AND(BL$225=1,AO226>0),AO226,\"\"))","v":""},{"$f":"IF($AQ226=0,\"\",IF(AND(BM$225=1,AP226>0),AP226,\"\"))","v":""},null,null,"d ingresso (C) mm",30,30,30,30,30,30,30,30,30,30,40,40,40,40,40,40,22,22,22,22,22,null,"d ingresso (C) mm",30,30,30,30,30,30,30,30,30,30,40,40,40,40,40,40,22,22,22,22,22,null,"d ingresso (C) mm",30,30,30,30,30,30,30,30,30,30,40,40,40,40,40,40,22,22,22,22,22]
[{"$nulls":20},"UE003",{"$nulls":21},0,"","","","","","","","","","","","","","","",null,"","","","","","",null,null,"sezione (B) mm",45,{"$nulls":9},60,{"$nulls":5},35,{"$nulls":5},"sezione (B) mm",45,{"$nulls":9},60,{"$nulls":5},35,{"$nulls":5},"sezione (B) mm",45,{"$nulls":9},60,{"$nulls":5},35]
[{"$nulls":20},"UE005",{"$nulls":21},0,"","","","","","","","","","","","","","","",null,"","","","","","",null,null,"lunghezza (A) mm",300,350,450,450,600,600,850,1050,1250,1650,600,850,1050,1250,1650,2050,300,350,450,600,850,null,"lunghezza (A) mm",300,350,450,450,600,600,850,1050,1250,1650,600,850,1050,1250,1650,2050,300,350,450,600,850,null,"lunghezza (A) mm",300,350,450,450,600,600,850,1050,1250,1650,600,850,1050,1250,1650,2050,300,350,450,600,850]
[{"$nulls":20},"UE008",{"$nulls":21},0,"","","","","","","","","","","","","","","",null,"","","","","","",null,null,"UE001",{"$nulls":22},"UE001",{"$nulls":22},"UE001"]
[{"$nulls":20},"UE009",{"$nulls":21},0,"","","","","","","","","","","","","","","",null,"","","","","","",null,null,"UE003",{"$nulls":22},"UE003",{"$nulls":22},"UE003"]
[{"$nulls":20},"UE010",{"$nulls":21},0,"","","","","","","","","","","","","","","",null,"","","","","","",null,null,"UE005",{"$nulls":22},"UE005",{"$nulls":22},"UE005"]
[{"$nulls":20},"UE015",{"$nulls":21},0,"","","","","","","","","","","","","","","",null,"","","","","","",null,null,"UE008",{"$nulls":22},"UE008",{"$nulls":22},"UE008"]
[{"$nulls":20},"UE018",{"$nulls":21},{"$f":"IF(U233=$V$183,1,0)","v":0},{"$f":"IF($AQ233=0,\"\",IF(AND(AR$225=1,V233>0),V233,\"\"))","v":""},"","","","","","","","","","","","","","",null,"","","","","","",null,null,"UE009",{"$nulls":22},"UE009",{"$nulls":22},"UE009"]
[{"$nulls":20},"UE025",{"$nulls":10},2,2,2,2,2,{"$nulls":6},0,"","","","","","","","","","","","","","","",null,"","","","","","",null,null,"UE010",{"$nulls":22},"UE010",{"$nulls":22},"UE010"]
[{"$nulls":20},"UE035",{"$nulls":12},2,2,2,null,2,{"$nulls":4},0,"","","","","","","","","","","","","","","",null,"","","","","","",null,null,"UE015",{"$nulls":22},"UE015",{"$nulls":22},"UE015"]
[{"$nulls":20},"UE045",{"$nulls":16},2,2,{"$nulls":3},0,"","","","","","","","","","","","","","","",null,"","","","","","",null,null,"UE018",{"$nulls":22},"UE018",{"$nulls":22},"UE018"]
[{"$nulls":20},"UE065",{"$nulls":16},4,{"$nulls":4},0,"","","","","","","","","","","","","","","",null,"","","","","","",null,null,"UE025",{"$nulls":5},"2A","2A","2A","2A","2A",{"$nulls":11},1,"UE025",{"$nulls":5},"B","A","A","A","A",{"$nulls":12},"UE025",{"$nulls":5},2,2,2,2,2,{"$nulls":11},2]
[{"$nulls":20},"UE090",{"$nulls":16},4,4,{"$nulls":3},0,"","","","","","","","","","","","","","","",null,"","","","","","",null,null,"UE035",{"$nulls":6},"2A","2A","2A","2A",null,"2B",{"$nulls":9},1,"UE035",{"$nulls":6},"A","A","A","A",null,"B",{"$nulls":10},"UE035",{"$nulls":6},2,2,2,2,null,2,{"$nulls":9},2]
[{"$nulls":20},"UE130",{"$nulls":21},0,"","","","","","","","","","","","","","","",null,{"$f":"IF($AQ239=0,\"\",IF(AND(BH$225=1,AK239>0),AK239,\"\"))","v":""},{"$f":"IF($AQ239=0,\"\",IF(AND(BI$225=1,AL239>0),AL239,\"\"))","v":""},{"$f":"IF($AQ239=0,\"\",IF(AND(BJ$225=1,AM239>0),AM239,\"\"))","v":""},{"$f":"IF($AQ239=0,\"\",IF(AND(BK$225=1,AN239>0),AN239,\"\"))","v":""},{"$f":"IF($AQ239=0,\"\",IF(AND(BL$225=1,AO239>0),AO239,\"\"))","v":""},{"$f":"IF($AQ239=0,\"\",IF(AND(BM$225=1,AP239>0),AP239,\"\"))","v":""},null,null,"UE045",{"$nulls":11},"2B","2B",{"$nulls":8},1,{"$nulls":23},"UE045",{"$nulls":11},2,2,{"$nulls":8},2]
[{"$nulls":20},"UR002",{"$nulls":21},0,"","","","","","","","","","","",{"$f":"IF($AQ240=0,\"\",IF(AND(BC$225=1,AG240>0),AG240,\"\"))","v":""},{"$f":"IF($AQ240=0,\"\",IF(AND(BD$225=1,AH240>0),AH240,\"\"))","v":""},{"$f":"IF($AQ240=0,\"\",IF(AND(BE$225=1,AI240>0),AI240,\"\"))","v":""},{"$f":"IF($AQ240=0,\"\",IF(AND(BF$225=1,AJ240>0),AJ240,\"\"))","v":""},null,{"$f":"IF($AQ240=0,\"\",IF(AND(BH$225=1,AK240>0),AK240,\"\"))","v":""},"","","","","",null,"230 3 phase","UE045 ",{"$nulls":10},"1B",null,null,"1B","1B","1B",{"$nulls":5},1,"UE045 ",{"$nulls":10},"B","B","B","B","B","B",{"$nulls":6},"UE045 ",{"$nulls":10},1,null,null,1,1,1,{"$nulls":5},1]
[{"$nulls":20},"UR004",{"$nulls":21},0,"","","","","","","","","","","","","","","",null,"","","","","","",null,null,"UE065",{"$nulls":11},"4B",{"$nulls":9},1,"UE065",{"$nulls":11},"B",{"$nulls":10},"UE065",{"$nulls":11},4,{"$nulls":9},4]
[{"$nulls":20},"UR006",{"$nulls":21},0,"","","","","","","","","","","","","","","",null,"","","","","","",null,null,"UE090",{"$nulls":11},"4B","4B",{"$nulls":8},1,"UE090",{"$nulls":11},"B","B",{"$nulls":9},"UE090",{"$nulls":11},4,4,{"$nulls":8},4]
[{"$nulls":20},"UR010",{"$nulls":21},0,"","","","","","","","","","","","","","","",null,"","","","","","",null,null,"UE130",{"$nulls":22},"UE130",{"$nulls":22},"UE130"]
[{"$nulls":20},"UR020",{"$nulls":21},0,"","","","","","","","","","","","","","","",null,"","","","","","",null,null,"UR002",{"$nulls":22},"UR002",{"$nulls":22},"UR002"]
[{"$nulls":20},"UR027",{"$nulls":21},0,"","","","","","","","","","","","","","","",null,"","","","","","",null,null,"UR004",{"$nulls":22},"UR004",{"$nulls":22},"UR004"]
[{"$nulls":20},"UR040",{"$nulls":16},2,{"$nulls":4},0,"","","","","","","","","","","","","","","",null,"","","","","","",null,null,"UR006",{"$nulls":22},"UR006",{"$nulls":22},"UR006"]
[{"$nulls":20},"UR060",{"$nulls":16},4,{"$nulls":4},0,"","","","","","","","","","","","","","","",null,"","","","","","",null,null,"UR010",{"$nulls":22},"UR010",{"$nulls":22},"UR010"]
[{"$nulls":20},"UG045",{"$nulls":21},0,"","","","","","","","","","","","","","","",null,"","","","","","",null,null,"UR013",{"$nulls":22},"UR013",{"$nulls":22},"UR013"]
[{"$nulls":20},"UG090",{"$nulls":16},4,4,{"$nulls":3},0,"","","","","","","","","","","","","","","",null,"","","","","","",null,null,"UR020",{"$nulls":3},"2A","2A","2A","2A","2A","2A","2A",{"$nulls":11},1,"UR020",{"$nulls":3},"A","A","A","A","A","A","A",{"$nulls":12},"UR020",{"$nulls":3},2,2,2,2,2,2,2,{"$nulls":11},2]
[{"$nulls":20},"UG180",{"$nulls":21},0,"","","","","","","","","","","","","","","",null,"","","","","","",null,null,"UR027",{"$nulls":3},"2A",null,"2A","2A","2A","2A","2A",{"$nulls":11},1,"UR027",{"$nulls":3},"A",null,"A","A","A","A","A",{"$nulls":12},"UR027",{"$nulls":3},2,null,2,2,2,2,2,{"$nulls":11},2]
[{"$nulls":43},{"$f":"IF(SUM(AS251:$BM$251)=0,SUM(AR226:AR250),0)","v":0},{"$f":"IF(SUM(AT251:$BM$251)=0,SUM(AS226:AS250),0)","v":0},{"$f":"IF(SUM(AU251:$BM$251)=0,SUM(AT226:AT250),0)","v":0},{"$f":"IF(SUM(AV251:$BM$251)=0,SUM(AU226:AU250),0)","v":0},{"$f":"IF(SUM(AW251:$BM$251)=0,SUM(AV226:AV250),0)","v":0},{"$f":"IF(SUM(AX251:$BM$251)=0,SUM(AW226:AW250),0)","v":0},{"$f":"IF(SUM(AY251:$BM$251)=0,SUM(AX226:AX250),0)","v":0},{"$f":"IF(SUM(AZ251:$BM$251)=0,SUM(AY226:AY250),0)","v":0},{"$f":"IF(SUM(BA251:$BM$251)=0,SUM(AZ226:AZ250),0)","v":0},{"$f":"IF(SUM(BB251:$BM$251)=0,SUM(BA226:BA250),0)","v":0},{"$f":"IF(SUM(BC251:$BM$251)=0,SUM(BB226:BB250),0)","v":0},{"$f":"IF(SUM(BD251:$BM$251)=0,SUM(BC226:BC250),0)","v":0},{"$f":"IF(SUM(BE251:$BM$251)=0,SUM(BD226:BD250),0)","v":0},{"$f":"IF(SUM(BF251:$BM$251)=0,SUM(BE226:BE250),0)","v":0},{"$f":"IF(SUM(BH251:$BM$251)=0,SUM(BF226:BF250),0)","v":0},null,{"$f":"IF(SUM(BI251:$BM$251)=0,SUM(BH226:BH250),0)","v":0},{"$f":"IF(SUM(BJ251:$BM$251)=0,SUM(BI226:BI250),0)","v":0},{"$f":"IF(SUM(BK251:$BM$251)=0,SUM(BJ226:BJ250),0)","v":0},{"$f":"IF(SUM(BL251:$BM$251)=0,SUM(BK226:BK250),0)","v":0},{"$f":"IF(SUM(BM251:$BM$251)=0,SUM(BL226:BL250),0)","v":0},{"$f":"SUM(BM226:BM250)","v":0},null,null,"UR040",{"$nulls":11},"2B","2B",{"$nulls":8},1,"UR040",{"$nulls":11},"B","B",{"$nulls":9},"UR040",{"$nulls":11},2,2,{"$nulls":8},2]
[{"$nulls":20},"Numero DP",{"$f":"SUM(AR251:BM251)","v":0},{"$nulls":3},"Numero delle Y",null,{"$f":"V252/2","v":0},{"$nulls":15},{"$f":"IF(AR251=0,0,AR223)","v":0},0,0,0,0,0,0,0,0,0,0,0,0,0,0,null,0,0,0,0,0,0,null,null,"UR053",{"$nulls":5},"4A","4A","4A","4A",{"$nulls":12},1,"UR053",{"$nulls":5},"A","A","A","A",{"$nulls":13},"UR053",{"$nulls":5},4,4,4,4,{"$nulls":12},4]
[{"$nulls":20},"Tipo DP",{"$f":"IF(V252=0,\"\",LOOKUP(SUM(AR252:BM252),AR223:BM223,AR222:BM222))","v":""},{"$nulls":21},{"$f":"IF(AR251=0,0,AR224)","v":0},0,0,0,0,0,0,0,0,0,0,0,0,0,0,null,0,0,0,0,0,0,null,null,"UR060",{"$nulls":11},"4B",{"$nulls":9},1,"UR060",{"$nulls":11},"B",{"$nulls":10},"UR060",{"$nulls":11},4,{"$nulls":9},4]
[{"$nulls":67},"UR080",{"$nulls":11},"4B","4B",{"$nulls":8},1,"UR080",{"$nulls":11},"B","B",{"$nulls":9},"UR080",{"$nulls":11},4,4,{"$nulls":8},4]
[{"$nulls":20},"Cè un DP",{"$f":"IF(SUM(V252,V218)>0,1,0)","v":1},{"$nulls":3},"Y",null,null,"D","?",{"$nulls":37},"UG045",{"$nulls":22},"UG045",{"$nulls":22},"UG045",{"$nulls":11},4,{"$nulls":9},4]
[{"$nulls":20},"Numero DP",{"$f":"IF($V$252<>0,$V$252,$V$218)","v":2},{"$f":"IF(V255=1,IF(V218>0,V218,V252),0)","v":2},null,null,"UEKY00000",null,null,30,{"$f":"SUM(AR253:BM253)","v":0},{"$f":"IF(AC256=AD256,1,0)","v":0},{"$f":"IF(AE256=0,\"\",Z256)","v":""},{"$nulls":35},"UG090",{"$nulls":11},"4B","4B",{"$nulls":8},1,"UG090",{"$nulls":11},"B","B",{"$nulls":9},"UG090",{"$nulls":11},4,4,{"$nulls":8},4]
[{"$nulls":20},"Tipo DP",{"$f":"IF(V255=0,\"N.A.\",IF($V$253=\"\",$V$219,$V$253))","v":"DP060D40RU"},{"$f":"IF(V255=1,IF(V218>0,V219,V253),\"\")","v":"DP060D40RU"},null,null,"UEKY40X400",null,null,40,{"$f":"AD256","v":0},{"$f":"IF(AC257=AD257,1,0)","v":0},{"$f":"IF(AE257=0,\"\",Z257)","v":""},{"$nulls":35},"UG180",{"$nulls":22},"UG180",{"$nulls":22},"UG180"]
[{"$nulls":20},"C'è Y?",{"$f":"IF(AND(V255=1,V218=0),1,0)","v":0},{"$f":"IF(AND(V255=1,V218=0),1,0)","v":0},{"$nulls":48},1,1,1,1,1,1,1,1,1,1,1,1,1,{"$nulls":10},"A","A","A/B","A","A","A","A","B","B","B","B","B","B"]
[{"$nulls":20},"Codice Y",{"$f":"CONCATENATE(AF256,AF257)","v":""}]
[{"$nulls":67},"A","Utilizzare kit Carel a Y cod. UEKY000000, ingresso 40 mm e 2 uscite 30 mm",{"$nulls":21},{"$f":"HLOOKUP(SELECTION!B11,DESIGN!CN225:DH258,31,0)","v":{"$error":"#N/A"}}]
[{"$nulls":67},"B","Utilizzare kit Carel a Y cod. UEKY40400, ingresso 40 mm e 2 uscite 40 mm"]

{"sheet":"SELECTION","index":4,"n_rows":52,"n_cols":20,"rows_kept":52,"merged":[[5,2,5,8],[5,10,5,11],[6,2,6,8],[6,10,6,11],[9,2,9,8],[9,10,9,11],[10,2,10,8],[10,10,10,11],[14,2,14,8],[14,10,14,11],[15,2,15,8],[15,10,15,11],[19,2,19,8],[19,10,19,11],[20,2,20,8],[20,10,20,11],[24,2,24,8],[24,10,24,11],[25,2,25,8],[25,10,25,11],[29,2,29,8],[29,10,29,11],[30,2,30,8],[30,10,30,11],[31,2,31,8],[31,10,31,11],[32,2,32,8],[32,10,32,11],[33,2,33,8],[33,10,33,11],[34,2,34,8],[34,10,34,11],[35,2,35,8],[35,10,35,11],[39,2,39,8],[39,10,39,11],[40,2,40,6],[40,10,40,11],[41,2,41,8],[41,10,41,11],[42,2,42,6],[42,7,42,8],[42,10,42,11],[48,8,48,9],[48,10,48,11],[48,14,48,15],[51,1,51,11],[52,1,62,11]]}
[]
[]
[null,{"$f":"LINGUA!B3","v":"INSTRUCTIONS: insert input data in grey cells. Results appear in green cells."},{"$nulls":17},"50 Hz"]
[{"$nulls":19},"60 Hz"]
[null,{"$f":"LINGUA!B44","v":"Humidifier"}]
[null,{"$f":"LINGUA!$B$27","v":"Code"},{"$f":"LINGUA!$B$28","v":"Description"},{"$nulls":6},{"$f":"LINGUA!$B$26","v":"Quantity"},{"$f":"LINGUA!$B$29","v":"List price"},{"$nulls":8},{"$f":"LINGUA!C541","v":"No NSF Certification"}]
[null,{"$f":"DESIGN!F110","v":"UR080HL103"},{"$f":"CONCATENATE(VLOOKUP(B7,CODICI!$B:$D,2,0),Potenze!F2)","v":"heaterSteam 80 kg/h , 400Vac 3~, with regulation, Titanium version -60 kW -"},{"$nulls":6},{"$f":"DESIGN!Z139","v":1},{"$f":"J7*VLOOKUP($B$7,CODICI!$B:$F,5,0)","v":{"v":6769,"d":"6,769.00"}},{"$nulls":8},{"$f":"LINGUA!C542","v":"With NSF Certification"}]
[]
[null,{"$f":"CONCATENATE(LINGUA!B45, \"  (\",DESIGN!I134,\")\")","v":"Steam distributor  (Chosen by the tool)"},{"$nulls":5},{"$f":"LINGUA!$B$31","v":"Do you want it? (Yes or No)?"}]
[null,{"$f":"LINGUA!$B$27","v":"Code"},{"$f":"LINGUA!$B$28","v":"Description"},{"$nulls":6},{"$f":"LINGUA!$B$26","v":"Quantity"},{"$f":"LINGUA!$B$29","v":"List price"}]
[null,{"$f":"IF(I9=LINGUA!$B$34,DESIGN!D120,\"\")","v":""},{"$f":"IF(B11=\"\",\"\",IF(I9=LINGUA!$B$34,VLOOKUP($B$11,CODICI!$B:$D,2,0),\"\"))","v":""},{"$nulls":6},{"$f":"IF(I9=LINGUA!$B$34,DESIGN!G120,\"\")","v":""},{"$f":"IF(B11=\"\",\"\",J11*IF(I9=LINGUA!$B$34,VLOOKUP($B$11,CODICI!$B:$F,5,0),\"\"))","v":""}]
[null,{"$f":"LINGUA!C544","v":"For short absorption distance, take into account the installation of ultimateSAM distributors"}]
[]
[null,{"$f":"CONCATENATE(LINGUA!B51, \"  (\",DESIGN!I134,\")\")","v":"Y connection for steam hose  (Chosen by the tool)"}]
[null,{"$f":"LINGUA!$B$27","v":"Code"},{"$f":"LINGUA!$B$28","v":"Description"},{"$nulls":6},{"$f":"LINGUA!$B$26","v":"Quantity"},{"$f":"LINGUA!$B$29","v":"List price"}]
[null,{"$f":"IF(I9=LINGUA!$B$34,DESIGN!D131,\" \")","v":" "},{"$f":"IF(I9=LINGUA!$B$34,IF(B16=\" \",\"\",VLOOKUP($B$16,CODICI!$B:$C,2,0)),\"\")","v":""},{"$nulls":6},{"$f":"IF(I9=LINGUA!$B$34,IF(B16<>\" \",(DESIGN!G131*J7),\"\"),\"\")","v":""},{"$f":"IF(I9=LINGUA!$B$34,IF(B16=\" \",\" \",J16*VLOOKUP(B16,CODICI!$B:$F,5,0)),\"\")","v":""}]
[]
[]
[null,{"$f":"LINGUA!B46","v":"Steam hose"},{"$nulls":5},{"$f":"LINGUA!$B$31","v":"Do you want it? (Yes or No)?"}]
[null,{"$f":"LINGUA!$B$27","v":"Code"},{"$f":"LINGUA!$B$28","v":"Description"},{"$nulls":7},{"$f":"LINGUA!$B$29","v":"List price"}]
[null,{"$f":"IF(I19=LINGUA!$B$34,DESIGN!V148,\"\")","v":""},{"$f":"IF(I19=LINGUA!$B$34,VLOOKUP($B$21,CODICI!$B:$D,2,0),\"\")","v":""},{"$nulls":7},{"$f":"IF(I19=LINGUA!$B$34,J21*VLOOKUP($B$21,CODICI!$B:$F,5,0),\"\")","v":""}]
[]
[]
[null,{"$f":"LINGUA!B47","v":"Drain hose"},{"$nulls":5},{"$f":"LINGUA!$B$31","v":"Do you want it? (Yes or No)?"}]
[null,{"$f":"LINGUA!$B$27","v":"Code"},{"$f":"LINGUA!$B$28","v":"Description"},{"$nulls":7},{"$f":"LINGUA!$B$29","v":"List price"}]
[null,{"$f":"IF(I24=LINGUA!$B$34,DESIGN!W152,\"\")","v":""},{"$f":"IF(I24=LINGUA!$B$34,VLOOKUP(B26,CODICI!$B:$D,2,0),\"\")","v":""},{"$nulls":7},{"$f":"IF(I24=LINGUA!$B$34,J26*VLOOKUP(B26,CODICI!$B:$F,5,0),\"\")","v":""}]
[]
[]
[null,{"$f":"LINGUA!B25","v":"Active probe for ducts"}]
[null,{"$f":"LINGUA!$B$27","v":"Code"},{"$f":"LINGUA!$B$28","v":"Description"},{"$nulls":7},{"$f":"LINGUA!$B$29","v":"List price"}]
[null,{"$f":"DESIGN!U157","v":"DPWC112000"},{"$f":"VLOOKUP($B31,CODICI!$B:$D,2,0)","v":"Active wall mounting sensor: Temperature (-10T60 °C) and humidity (10 to 90% rH)"},{"$nulls":7},{"$f":"J31*VLOOKUP($B31,CODICI!$B:$F,5,0)","v":{"v":0,"d":"0.00"}}]
[null,{"$f":"DESIGN!U158","v":"DPPC112000"},{"$f":"VLOOKUP($B32,CODICI!$B:$D,2,0)","v":"Active sensor for industrial environments: Temperature (-20T70 °C) and humidity (10 to 90% rH)"},{"$nulls":7},{"$f":"J32*VLOOKUP($B32,CODICI!$B:$F,5,0)","v":{"v":0,"d":"0.00"}}]
[null,{"$f":"DESIGN!U159","v":"DPPC212000"},{"$f":"VLOOKUP($B33,CODICI!$B:$D,2,0)","v":"Active sensor for industrial environments: Temperature (-20T70 °C) and humidity (0 to 100% rH)"},{"$nulls":7},{"$f":"J33*VLOOKUP($B33,CODICI!$B:$F,5,0)","v":{"v":0,"d":"0.00"}}]
[null,{"$f":"DESIGN!U160","v":"DPDC112000"},{"$f":"VLOOKUP($B34,CODICI!$B:$D,2,0)","v":"Active sensor for ducts: Temperature (-20T70 °C) and humidity (10 to 90% rH)"},{"$nulls":7},{"$f":"J34*VLOOKUP($B34,CODICI!$B:$F,5,0)","v":{"v":0,"d":"0.00"}}]
[null,{"$f":"DESIGN!U161","v":"DPDC212000"},{"$f":"VLOOKUP($B35,CODICI!$B:$D,2,0)","v":"Active sensor for ducts: Temperature (-20T70 °C) and humidity (0 to 100% rH)"},{"$nulls":7},{"$f":"J35*VLOOKUP($B35,CODICI!$B:$F,5,0)","v":{"v":0,"d":"0.00"}}]
[null,{"$f":"DESIGN!U162","v":"ASET030001"},{"$f":"VLOOKUP($B36,CODICI!$B:$D,2,0)","v":"Temperature probe (-30T90 °C) for universal use"},{"$nulls":7},{"$f":"J36*VLOOKUP($B36,CODICI!$B:$F,5,0)","v":{"v":0,"d":"0.00"}}]
[]
[]
[null,{"$f":"LINGUA!C522","v":"WTS revers osmosis system"},{"$nulls":5},{"$f":"LINGUA!$B$31","v":"Do you want it? (Yes or No)?"},{"$nulls":6},"UR"]
[null,{"$f":"LINGUA!$B$27","v":"Code"},{"$f":"LINGUA!$B$28","v":"Description"},{"$nulls":6},{"$f":"LINGUA!$B$26","v":"Quantity"},{"$nulls":3},{"$f":"MID(B7,1,2)","v":"UR"},"UG"]
[null,{"$f":"IF(I39=LINGUA!$B$34,IF(N40=\"UG\",VLOOKUP(B7,Commissioning!H27:J32,3,0),IF(I41=Commissioning!G2,VLOOKUP(Commissioning!F22,Commissioning!H2:J12,3,0),(VLOOKUP(Commissioning!F22,Commissioning!H13:J23,3,0)))),\"\")","v":""},{"$f":"IF(I39=LINGUA!$B$34,VLOOKUP(B41,Commissioning!J2:K32,2,0),\" \")","v":" "},{"$nulls":4},{"$f":"IF(N40=O39,LINGUA!C530,\" \")","v":"grid frequency"},"50 Hz",1,{"$f":"IF(N40=O41,\"\",IF(I39=LINGUA!$B$34,J41*VLOOKUP(B41,CODICI!$B:$F,5,0),\" \"))","v":" "},{"$nulls":3},"UE"]
[null,{"$f":"IF(I39=LINGUA!$B$34,IF(N40=\"UG\",VLOOKUP(B7,Commissioning!H27:L32,5,0),IF(I41=Commissioning!G2,VLOOKUP(Commissioning!F22,Commissioning!H2:L12,5,0),(VLOOKUP(Commissioning!F22,Commissioning!H13:L23,5,0)))),\"\")","v":""},{"$f":"IF(I39=LINGUA!$B$34,VLOOKUP(B42,LINGUA!B523:C543,2,0), \"  \")","v":"  "},{"$nulls":6},1,{"$f":"(IF(N40=O41,\"\",IF(I39=LINGUA!$B$34,J42*VLOOKUP(B42,CODICI!B444:F455,5,0),\" \")))","v":" "}]
[null,{"$f":"IF(I39=LINGUA!$B$34,IF(H43=T6,LINGUA!B539,LINGUA!B540), \"\")","v":""},{"$f":"IF(I39=LINGUA!$B$34,VLOOKUP(B43,LINGUA!B523:C543,2,0), \"  \")","v":"  "},{"$nulls":4},"Con Certificazione NSF",null,1,{"$f":"IF(N40=O41,\"\",IF(I39=LINGUA!$B$34,J43*VLOOKUP(B43,CODICI!B445:F460,5,0),\" \"))","v":" "}]
[]
[]
[null,{"$f":"LINGUA!C562","v":"Currency"},"Eur",{"$nulls":6},{"$f":"LINGUA!B36","v":"Discount"},{"v":0,"d":"0%"}]
[null,null,{"$f":"IF(C46=\"Eur\",\"€\",IF(C46=\"GBP\",\"£\",\"$\"))","v":"€"}]
[null,{"$f":"LINGUA!C563","v":"Exchange rate"},{"$f":"VLOOKUP(C46,Currencies!$A:$B,2,FALSE)","v":{"v":0,"d":"0.00"}},"Eur/",{"$f":"C46","v":"Eur"}]
[{"$nulls":8},{"$f":"LINGUA!C763","v":"Total"},null,{"$f":"SUM(K7,K11,K21,K26,K31,K32,K33,K34,K16,K35,K36,K41,K42,K43)*(1-K46)","v":{"v":6769,"d":"6,769.00"}}]
[]
[]
[null,{"$f":"LINGUA!C546","v":"Note:"}]

{"sheet":"OFFER","index":5,"n_rows":32,"n_cols":16,"rows_kept":32,"merged":[[2,1,2,3],[4,1,4,3],[7,1,7,5],[30,1,30,5],[31,1,42,5]]}
[]
[]
[null,{"$f":"DESIGN!C35","v":"External Air"},null,null,{"$f":"DESIGN!C77","v":"Air flow V"},{"$f":"CONCATENATE(DESIGN!E77,DESIGN!F77)","v":"10000m^3/h"},{"$nulls":3},{"$f":"MID(DESIGN!J36,1,3)","v":"2,2"}]
[null,{"$f":"CONCATENATE(DESIGN!E36*100,\"%\",DESIGN!F36,)","v":"90%rH"},{"$f":"CONCATENATE(DESIGN!E37,DESIGN!F37)","v":"-5°C"},{"$f":"CONCATENATE(J3,DESIGN!K36)","v":"2,2g/kg"},{"$f":"LINGUA!C556","v":"Humidification load"},{"$f":"CONCATENATE(J6,\" \",DESIGN!F84,)","v":"60,9 kg/h"},{"$nulls":3},{"$f":"MID(DESIGN!E84,1,4)","v":"60,9"}]
[null,{"$f":"CONCATENATE(DESIGN!C40,\":\",)","v":"Air after the humidifier:"},{"$nulls":7},{"$f":"MID(DESIGN!J41,1,3)","v":"7,2"}]
[null,{"$f":"CONCATENATE(DESIGN!E41*100,\"%\",DESIGN!F41,)","v":"50%rH"},{"$f":"CONCATENATE(DESIGN!E42,DESIGN!F42)","v":"20°C"},{"$f":"CONCATENATE(J5,DESIGN!K36)","v":"7,2g/kg"},{"$nulls":5},{"$f":"MID(DESIGN!E84,1,4)","v":"60,9"}]
[]
[null," "]
[]
[null,{"$f":"LINGUA!B41","v":"Position"},{"$f":"LINGUA!B26","v":"Quantity"},{"$f":"LINGUA!B42","v":"Code"},{"$f":"LINGUA!B28","v":"Description"},{"$f":"LINGUA!C543","v":"Net price"}]
[null,1,{"$f":"IF(D11=\"\",\"\",SELECTION!J7)","v":1},{"$f":"SELECTION!B7","v":"UR080HL103"},{"$f":"IF(D11=\"\",\"\",SELECTION!C7)","v":"heaterSteam 80 kg/h , 400Vac 3~, with regulation, Titanium version -60 kW -"},{"$f":"IF(F28=TRUE,IF(D11=\"\",\"\",(SELECTION!K7*(1-SELECTION!K46))),\" \")","v":6769},{"$nulls":9},{"$f":"IF(D11=\"\",\"\",(SELECTION!K7*(1-SELECTION!K46)))","v":6769}]
[null,{"$f":"IF(D12=\"\",\"\",MAX($B$11:B11)+1)","v":""},{"$f":"IF(D12=\"\",\"\",SELECTION!J11)","v":""},{"$f":"IF(SELECTION!I9=LINGUA!$B$34,SELECTION!B11,\"\")","v":""},{"$f":"IF(D12=\"\",\"\",SELECTION!C11)","v":""},{"$f":"IF($F$28=TRUE,IF(D12=\"\",\"\",P12), \" \")","v":""},{"$nulls":9},{"$f":"IF(D12=\"\",\"\",SELECTION!K11*(1-SELECTION!$K$46))","v":""}]
[null,{"$f":"IF(D13=\"\",\"\",MAX($B$11:B12)+1)","v":""},{"$f":"IF(D13=\"\",\"\",SELECTION!J16)","v":""},{"$f":"IF(OR(SELECTION!B16=\" \",SELECTION!J16=0),\"\",SELECTION!B16)","v":""},{"$f":"IF(D13=\"\",\"\",SELECTION!C16)","v":""},{"$f":"IF($F$28=TRUE,IF(D13=\"\",\"\",P13),\"\")","v":""},{"$nulls":9},{"$f":"IF(D13=\"\",\"\",SELECTION!K16*(1-SELECTION!$K$46))","v":""}]
[null,{"$f":"IF(D14=\"\",\"\",MAX($B$11:B13)+1)","v":""},{"$f":"IF(D14=\"\",\"\",SELECTION!J21)","v":""},{"$f":"IF(SELECTION!I19=LINGUA!$B$34,SELECTION!B21,\"\")","v":""},{"$f":"IF(D14=\"\",\"\",SELECTION!C21)","v":""},{"$f":"IF($F$28=TRUE,IF(D14=\"\",\"\",P14), \" \")","v":""},{"$nulls":9},{"$f":"IF(D14=\"\",\"\",SELECTION!K21*(1-SELECTION!$K$46))","v":""}]
[null,{"$f":"IF(D15=\"\",\"\",MAX($B$11:B14)+1)","v":""},{"$f":"IF(D15=\"\",\"\",SELECTION!J26)","v":""},{"$f":"IF(SELECTION!I24=LINGUA!$B$34,SELECTION!B26,\"\")","v":""},{"$f":"IF(D15=\"\",\"\",SELECTION!C26)","v":""},"",{"$nulls":9},{"$f":"IF(D15=\"\",\"\",SELECTION!K26*(1-SELECTION!$K$46))","v":""}]
[null,{"$f":"IF(D16=\"\",\"\",MAX($B$11:B15)+1)","v":""},{"$f":"IF(D16=\"\",\"\",SELECTION!J31)","v":""},{"$f":"IF(SELECTION!J31=0,\"\",SELECTION!B31)","v":""},{"$f":"IF(D16=\"\",\"\",SELECTION!C31)","v":""},"",{"$nulls":9},{"$f":"IF(D16=\"\",\"\",SELECTION!K31*(1-SELECTION!$K$46))","v":""}]
[null,{"$f":"IF(D17=\"\",\"\",MAX($B$11:B16)+1)","v":""},{"$f":"IF(D17=\"\",\"\",SELECTION!J32)","v":""},{"$f":"IF(SELECTION!J32=0,\"\",SELECTION!B32)","v":""},{"$f":"IF(D17=\"\",\"\",SELECTION!C32)","v":""},"",{"$nulls":9},{"$f":"IF(D17=\"\",\"\",SELECTION!K32*(1-SELECTION!$K$46))","v":""}]
[null,{"$f":"IF(D18=\"\",\"\",MAX($B$11:B17)+1)","v":""},{"$f":"IF(D18=\"\",\"\",SELECTION!J33)","v":""},{"$f":"IF(SELECTION!J33=0,\"\",SELECTION!B33)","v":""},{"$f":"IF(D18=\"\",\"\",SELECTION!C33)","v":""},"",{"$nulls":9},{"$f":"IF(D18=\"\",\"\",SELECTION!K33*(1-SELECTION!$K$46))","v":""}]
[null,{"$f":"IF(D19=\"\",\"\",MAX($B$11:B18)+1)","v":""},{"$f":"IF(D19=\"\",\"\",SELECTION!J34)","v":""},{"$f":"IF(SELECTION!J34=0,\"\",SELECTION!B34)","v":""},{"$f":"IF(D19=\"\",\"\",SELECTION!C34)","v":""},"",{"$nulls":9},{"$f":"IF(D19=\"\",\"\",SELECTION!K34*(1-SELECTION!$K$46))","v":""}]
[null,{"$f":"IF(D20=\"\",\"\",MAX($B$11:B19)+1)","v":""},{"$f":"IF(D20=\"\",\"\",SELECTION!J35)","v":""},{"$f":"IF(SELECTION!J35=0,\"\",SELECTION!B35)","v":""},{"$f":"IF(D20=\"\",\"\",SELECTION!C35)","v":""},"",{"$nulls":9},{"$f":"IF(D20=\"\",\"\",SELECTION!K35*(1-SELECTION!$K$46))","v":""}]
[null,{"$f":"IF(D21=\"\",\"\",MAX($B$11:B20)+1)","v":""},{"$f":"IF(D21=\"\",\"\",SELECTION!J36)","v":""},{"$f":"IF(SELECTION!J36=0,\"\",SELECTION!B36)","v":""},{"$f":"IF(D21=\"\",\"\",SELECTION!C36)","v":""},"",{"$nulls":9},{"$f":"IF(D21=\"\",\"\",SELECTION!K36*(1-SELECTION!$K$46))","v":""}]
[null,{"$f":"IF(D22=\"\",\"\",MAX($B$11:B21)+1)","v":""},{"$f":"IF(SELECTION!N40=SELECTION!O41,\"\",IF(D22=\"\",\"\",SELECTION!J41))","v":""},{"$f":"IF(SELECTION!N40=SELECTION!O41,\"\",IF(SELECTION!J41=0,\"\",SELECTION!B41))","v":""},{"$f":"IF(D22=\"\",\"\",SELECTION!C41)","v":""},"",{"$nulls":9},{"$f":"IF(D22=\"\",\"\",SELECTION!K41*(1-SELECTION!$K$46))","v":""}]
[null,{"$f":"IF(D23=\"\",\"\",MAX($B$11:B22)+1)","v":""},{"$f":"IF(D23=\"\",\"\",SELECTION!J42)","v":""},{"$f":"IF(SELECTION!N40=SELECTION!O41,\"\",IF(SELECTION!J42=0,\"\",SELECTION!B42))","v":""},{"$f":"IF(D23=\"\",\"\",SELECTION!C42)","v":""},"",{"$nulls":9},{"$f":"IF(D23=\"\",\"\",SELECTION!K42*(1-SELECTION!$K$46))","v":""}]
[null,{"$f":"IF(D24=\"\",\"\",MAX($B$11:B23)+1)","v":""},{"$f":"IF(D24=\"\",\"\",SELECTION!J43)","v":""},{"$f":"IF(SELECTION!N40=SELECTION!O41,\"\",IF(SELECTION!J43=0,\"\",SELECTION!B43))","v":""},{"$f":"IF(D24=\"\",\"\",SELECTION!C43)","v":""},"",{"$nulls":9},{"$f":"IF(D24=\"\",\"\",SELECTION!K43*(1-SELECTION!$K$46))","v":""}]
[]
[{"$nulls":4},{"$f":"LINGUA!$B$30","v":"TOTAL"},{"$f":"SUM(P11:P24)","v":6769}]
[]
[{"$nulls":4},{"$f":"LINGUA!C521","v":"View Partial net prices"},true]
[]
[]
[null,{"$f":"LINGUA!C546","v":"Note:"}]
[null,{"$f":"SELECTION!$B$53","v":0}]

{"sheet":"Steam absoprtion distance-AUTO","index":6,"n_rows":51,"n_cols":33,"rows_kept":51,"hidden":true,"merged":[[5,1,5,3],[5,6,5,8],[5,11,5,13],[14,6,14,8]]}
[]
[{"$nulls":4},{"$f":"LINGUA!B3","v":"INSTRUCTIONS: insert input data in grey cells. Results appear in green cells."}]
[]
[{"$nulls":29},"ca",1.006,"kJ/kg*°K"]
[]
[null,"Input",{"$nulls":4},{"$f":"LINGUA!B6","v":"External Air"},{"$nulls":4},"Output"]
[]
[null,null,{"$f":"LINGUA!B45","v":"Steam distributor"},{"$nulls":4},{"$f":"LINGUA!B10","v":"Temperature"},{"$nulls":4},{"$f":"LINGUA!B59","v":"Max kg/h per distributor"}]
[null,null,{"$f":"DESIGN!D120","v":"DP060D40RU"},{"$nulls":4},{"$f":"DESIGN!E37","v":-5},{"$nulls":4},{"$f":"LOOKUP(AF36,AB15:AB35,AE15:AE35)","v":45}]
[]
[null,null,{"$f":"LINGUA!B57","v":"No. of distributors in the duct"},{"$nulls":4},{"$f":"LINGUA!B9","v":"Relative humidity"},{"$nulls":4},{"$f":"LINGUA!B60","v":"Distributor length (mm)"}]
[null,null,{"$f":"DESIGN!G120","v":2},{"$nulls":4},{"$f":"DESIGN!E36","v":{"v":0.9,"d":"90%"}},{"$nulls":4},{"$f":"LOOKUP(AF36,AB15:AB35,AD15:AD35)","v":600}]
[]
[null,null,{"$f":"LINGUA!B58","v":"Humidifier capacity (kg/h)"},{"$nulls":9},{"$f":"LINGUA!B20","v":"Air speed"},{"$nulls":14},"#","code","L mm","Max kg/h"]
[null,null,{"$f":"DP!AA1","v":{"v":80,"d":"80.00"}},{"$nulls":3},{"$f":"LINGUA!B14","v":"Duct"},{"$nulls":5},{"$f":"AG47","v":{"v":2.1043771043771042,"d":"2.10"}},{"$nulls":14},1,"DP030D22RU",300,4,{"$f":"IF(AC15=$C$9,1,0)*AB15","v":0}]
[{"$nulls":27},{"$f":"AB15+1","v":2},"DP035D22R0",332,4,0]
[{"$nulls":7},{"$f":"LINGUA!B18","v":"Air flow V"},{"$nulls":4},{"$f":"LINGUA!B61","v":"Humidification distance (m)"},{"$nulls":14},3,"DP045D22R0",438,6,0]
[{"$nulls":7},{"$f":"DESIGN!E77","v":{"v":10000,"d":"10,000"}},{"$nulls":4},{"$f":"ROUNDUP(IF(AND(G28=\"\",G29=\"\"),0.05+IF((3.26/(LN(0.119*AE51*((C15/(C12*(M12/1000)))^(0.26))*(AG47^(0.086))))^2)<0,0,(3.26/(LN(0.119*AE51*((C15/(C12*(M12/1000)))^(0.26))*(AG47^(0.086))))^2)),\"\")*1.1,2)","v":1.46},null,null,"=",{"$nulls":11},4,"DP060D22R0",597,9,0]
[{"$nulls":27},5,"DP085D22R0",835,9,0]
[{"$nulls":7},{"$f":"LINGUA!B16","v":"Internal height C2"},{"$nulls":4},{"$f":"ROUNDUP((M18*1.1),2)","v":1.61},{"$nulls":14},6,"DP030D30RU",300,15,0]
[{"$nulls":7},{"$f":"DESIGN!E76","v":1100},{"$nulls":19},7,"DP035D30R0",343,5,0]
[{"$nulls":27},8,"DP045D30R0",427,8,0]
[{"$nulls":7},{"$f":"LINGUA!B15","v":"Internal width C1"},{"$nulls":19},9,"DP045D30RU",450,15,0]
[{"$nulls":7},{"$f":"DESIGN!E75","v":1200},{"$nulls":19},10,"DP060D30R0",596,12,0]
[{"$nulls":11},{"$f":"LINGUA!B62","v":"The humidification distance is calculated using the work of Gundacker "},{"$nulls":15},11,"DP060D30RU",600,15,0]
[{"$nulls":27},12,"DP085D30R0",850,18,0]
[{"$nulls":27},13,"DP105D30R0",1048,18,0]
[{"$nulls":3},{"$f":"IF(OR(G28<>\"\",G29<>\"\",G30<>\"\",),\"ERROR\", \"\")","v":""},null,null,{"$f":"IF(M12>H24,LINGUA!B63,\"\")","v":""},{"$nulls":20},14,"DP125D30R0",1245,18,0]
[{"$nulls":6},{"$f":"IF((M9*C12)<C15,LINGUA!B64,\"\")","v":""},{"$nulls":20},15,"DP165D30R0",1640,18,0]
[{"$nulls":6},{"$f":"IF(C15/H18/1.2*1000+DESIGN!J36>AE50*1000,LINGUA!B519,\"\")","v":""},{"$nulls":20},16,"DP060D40RU",600,45,16]
[{"$nulls":27},17,"DP085D40R0",834,25,0]
[{"$nulls":27},18,"DP105D40R0",1015,35,0]
[{"$nulls":27},19,"DP125D40R0",1222,45,0]
[{"$nulls":27},20,"DP165D40R0",1636,45,0]
[{"$nulls":27},21,"DP205D40R0",2025,45,0]
[{"$nulls":31},{"$f":"SUM(AF15:AF35)","v":16}]
[]
[]
[{"$nulls":27},"a",-5674.359,-5800.2206,"c.s. aria J/(°C*g)=",1.006]
[{"$nulls":27},"b",6.3925247,1.3914993,"c.s. vapo J/(°C*g)=",1.805]
[{"$nulls":27},"c",-0.009677843,-0.048640239,"c latente J/g=",2501]
[{"$nulls":27},"d",{"v":6.2215701e-07,"d":"6.22E-07"},{"v":4.1764768e-05,"d":"4.18E-05"},"R Joule/Kmole*°K=",8313.6]
[{"$nulls":27},"e",{"v":2.0747825e-09,"d":"2.07E-09"},{"v":-1.4452093e-08,"d":"-1.45E-08"},"coefficiente fs",1.004]
[{"$nulls":27},"f",{"v":-9.484024e-13,"d":"-9.48E-13"},0,"coefficiente psi",0.62198]
[{"$nulls":27},"g",4.1635019,6.5459673]
[{"$nulls":27},"t in",{"$f":"H9","v":-5},"t fin",{"$f":"DESIGN!E42","v":20},"density",{"$f":"1.293*(AC50/101325)*(273.15/DESIGN!AF43)*(1/(1+1.6078*DESIGN!AF45/1000))","v":1.2045707891199364}]
[{"$nulls":27},"% in",{"$f":"H12","v":{"v":0.9,"d":"90%"}},null,null,"Air velocity m/sec",{"$f":"DESIGN!E79","v":{"v":2.1043771043771042,"d":"2.10"}}]
[{"$nulls":27},"T in",{"$f":"AC46+273.15","v":268.15},"T fin",{"$f":"AE46+273.15","v":293.15},"d x",{"$f":"AG49-AC51*1000","v":6.66663458545982}]
[{"$nulls":27},"Psat in",{"$f":"IF(AC46<0,EXP($AC$39/AC48+$AC$40+$AC$41*AC48+$AC$42*AC48^2+$AC$43*AC48^3+$AC$44*AC48^4+$AC$45*LN(AC48)),EXP($AD$39/AC48+$AD$40+$AD$41*AC48+$AD$42*AC48^2+$AD$43*AC48^3+$AD$44*AC48^4+$AD$45*LN(AC48)))","v":402.02925588076624},"Psat fin",{"$f":"IF(AE46<0,EXP($AC$39/AE48+$AC$40+$AC$41*AE48+$AC$42*AE48^2+$AC$43*AE48^3+$AC$44*AE48^4+$AC$45*LN(AE48)),EXP($AD$39/AE48+$AD$40+$AD$41*AE48+$AD$42*AE48^2+$AD$43*AE48^3+$AD$44*AE48^4+$AD$45*LN(AE48)))","v":2338.8037000739814},"x finale",{"$f":"IF(C15/H18/1.2*1000+DESIGN!J36<=AE50*1000,C15/H18/1.2*1000+DESIGN!J36,AE50*1000)","v":8.904600832823945}]
[{"$nulls":27},"P atm",{"$f":"DESIGN!W42","v":101325},"x sat",{"$f":"0.62198*1.004*AE49/(AC50-1.004*AE49)","v":0.014756056728637994},"t finale",{"$f":"DESIGN!Z43-273.15","v":{"v":20,"d":"20.0"}}]
[{"$nulls":27},"umi spec in kg/kg",{"$f":"$AF$43*$AF$44*AC47*AC49/(AC50-$AF$43*AC47*AC49)","v":0.002237966247364125},"eff sat",{"$f":"AG48/(1000*(AE50-AC51))","v":0.5325600254633571}]

{"sheet":"TENDER TEXT","index":7,"n_rows":13,"n_cols":8,"rows_kept":13,"merged":[[0,2,0,3],[0,4,0,5],[0,6,0,7],[2,1,6,1],[2,2,6,2],[2,3,6,3],[2,4,6,4],[2,5,6,5],[2,6,6,6],[2,7,6,7]]}
[null,null,"UR",null,"UE",null,"UG"]
[null,null,"ITALIANO",null,"ITALIANO",null,"ITALIANO"]
[null,{"$f":"IF(B12=C1,IF(B13=C2,D3,C3),IF(B12=E1,IF(B13=E2,E3,F3),IF(B12=G1,IF(B13=G2,G3,H3),\"\")))","v":"heaterSteam suggested standard Tender Text (UR*3 titanium)\n\nheaterSteam UR*3 titanium\n\nImmersed-resistances steam humidifier for ambient and AHU/duct using drinkable mains water, demineralised water or deionised water. Humidifier heats and boils the water in a stainless steel cylinder. The steam generated is hygienically pure (aseptic). \n\nMain technical specs:\nRated steam production …………….………kg/h\nRated power input …………………………..kW\nPower supply …………..…………………..VAC 1-phase / 3-phase\nNo. of steam outlets …….…………………….\nSteam outlet diameter ……………….……..mm\nSteam pressure……………….………….…..Pa\nSupply water connection…………..…3/4” G MALE\nDrain connection…………….……………..……40 mm\n\nAccessories for duct installations:\nSteam lance made of AISI304 with fitting flange and condensate outlet; length …….mm\nSteam nozzle distributor\nAccessories for ambient installations:\nSteam distributor with embedded blower, powder-painted metallic enclosure and air flow deflector for an even distribution of the steam into the ambient.\n\nHumidifiers shall have the following characteristics (2, 4, 6, 10, 13, 20, 27, 40, 53, 60, 80 kg/h):\n• Electric resistances made in titanium with low thermal resistance for fast response, stability of production and safety against overheating;\n• Water level sensor for the precise control of the water level on the entire conductivity range 0…1500µS/cm, without any change or additional board;\n• Each element shall have 1 patented PTC to detect and protect against overheating (patented); \n• User-editable configuration of the controller for the high-accuracy control of the humidity (± 1%rH);\n• Steam capacity shall be continuously controlled in the range 0..100% of the rated production;\n• Humidifier shall be suitable for any type of water: tap, demineralised, deionised and softener (≤1µS/cm heaterSteam titanium is needed);\n• Over-temperature protection on boiler cap (klixon, UR020-UR080);\n• Models 2-13 kg/h: the boiler shall be made of AISI304 stainless steel, openable for maintenance; models 20-80 kg/h: the boiler shall be made of AISI304 stainless steel, with the lid and a bottom front inspection panel removable for easy servicing;\n• Embedded conductimeter for the automatic management of the dilution drains and subsequent fills according to the supply water quality;\n• SSR’s (solid-state relays) for precise modulation of the steam production by dosing the power fed to the water;\n• Patented antifoam algorithm (AFS) to prevent irregular operation due to the formation of foam inside the cylinder;\n• The steam generator shall also have twin sensing electrodes for detection of water foaming and high limit water level;\n• Boiler thermal coating to reduce the heat loss;\n• Thermal shock feature, removing lime scale from the heating elements, extends the cleaning intervals and makes maintenance quicker;\n• Kevlar limescale bag inside the boiler for easy and quick maintenance (up to 13kg/h); doesn’t need any additional gaskets;\n• Boiler’s water temperature probe (NTC);\n• Pre-heating to keep the water warm in order to reduce the time to production (user-editable pre-heating set point);\n• The humidifier shall limit the steam production based on a proportional hi-limit probe that is self-adjusting according to AHU/duct air flow;\n• Humidifier shall have built-in power transformer, no needs of neutral line on power supply or additional external transformer;\n• Metallic housing with cover removable to allow full front access for easy maintenance;\n• Electrical section separated by a division wall and including the power circuitry and the control components, manufactured according to state-of-the-art norms;\n• The built-in USB port can be used for easy software updates, log file and alarm history extraction. Copy and paste parameters between units;\n• ON/OFF digital input for remote enabling;\n• Intelligent microprocessor controller with algorithm that automatically adapts operation to the water quality;\n• 4 built-in relays for remote signalling of: alarm relay, unit status relay (steam production), unit on/off, fan blower relay;\n• The type of electric signal shall be selectable via keyboard among: on/off (humidistat), 0…10 V, 2…10 V, 0…1 V, 0…20 mA, 4…20 mA and NTC (in case of temperature regulation); \n• RS485 serial port ready to communicate on Modbus, Bacnet or CAREL protocol for supervisory system. Without any additional devices;\n• Ethernet port ready to communicate on Modbus or Bacnet protocol for supervisory system.  Without any additional devices;\n• Strat-up wizard for simple step-by-step machine configuration during first commissioning;\n• Type of controller: control with 9 algorithms always available to the user: on/off, production proportional to an external demand,  production proportional to an external demand with modulating limiting probe, built-in %rH regulator with ambient probe, built-in %rH regulator with ambient probe and modulating limiting probe, built-in %rH regulator with two ambient probes (average), built-in temperature (°C/°F) regulator with ambient probe, built-in temperature (°C/°F) regulator with two ambient probes (average), built-in temperature (°C/°F) regulator with ambient and modulating limiting probe;\n• Master-slave capability to extend the capacity with automatic rotation of units;\n• Integrated backup of the unit for applications that require continuous service and non-stop humidification; \n• Maintenance backup to automatic start the second unit during the sevices; \n• Management of wireless probes (up to 4 ) to avoid cables into the building. User-editable of probes weight;\n• Plug&play web server for monitoring and setting of unit from remote position;\n• Keyboard to change the displayed value, edit the system parameters, reset the alarms;\n• Display of the supply water conductivity;\n• Selection of the units of measure (SI or Imperial);\n• Automatic check of valve, pump, water level sensor, presence of supply water at the start-up;\n• Automatic management of the lack of supply water with automatic restart when the water is available again;\n• Automatic maintenance warning;\n• Drain pump for full range of capacity (2…80 kg/h) that helps to remove debris;\n• The boiler shall be automatically emptied in case of prolonged inactivity, with the inactivity time-out being user-editable;\n• Compliances: CE, ETL, TÜV PRODUCT SERVICE, EAC;\n\n\n• [optional] wall-mounting %rH probe for civil environment (10 %rH … 90 %rH)\n• [optional] %rH & temperature industrial probe min. IP54 (0 %rH … 100 %rH, -10T70 °C)\n• [optional] %rH probe for duct min. IP40 (10 %rH … 90 %rH)\n• [optional] %rH limit probe for duct min. IP40 (0 %rH … 100 %rH)\n"},"heaterSteam suggested standard Tender Text (UR*3 titanium)\n\nheaterSteam UR*3 titanium\n\nImmersed-resistances steam humidifier for ambient and AHU/duct using drinkable mains water, demineralised water or deionised water. Humidifier heats and boils the water in a stainless steel cylinder. The steam generated is hygienically pure (aseptic). \n\nMain technical specs:\nRated steam production …………….………kg/h\nRated power input …………………………..kW\nPower supply …………..…………………..VAC 1-phase / 3-phase\nNo. of steam outlets …….…………………….\nSteam outlet diameter ……………….……..mm\nSteam pressure……………….………….…..Pa\nSupply water connection…………..…3/4” G MALE\nDrain connection…………….……………..……40 mm\n\nAccessories for duct installations:\nSteam lance made of AISI304 with fitting flange and condensate outlet; length …….mm\nSteam nozzle distributor\nAccessories for ambient installations:\nSteam distributor with embedded blower, powder-painted metallic enclosure and air flow deflector for an even distribution of the steam into the ambient.\n\nHumidifiers shall have the following characteristics (2, 4, 6, 10, 13, 20, 27, 40, 53, 60, 80 kg/h):\n• Electric resistances made in titanium with low thermal resistance for fast response, stability of production and safety against overheating;\n• Water level sensor for the precise control of the water level on the entire conductivity range 0…1500µS/cm, without any change or additional board;\n• Each element shall have 1 patented PTC to detect and protect against overheating (patented); \n• User-editable configuration of the controller for the high-accuracy control of the humidity (± 1%rH);\n• Steam capacity shall be continuously controlled in the range 0..100% of the rated production;\n• Humidifier shall be suitable for any type of water: tap, demineralised, deionised and softener (≤1µS/cm heaterSteam titanium is needed);\n• Over-temperature protection on boiler cap (klixon, UR020-UR080);\n• Models 2-13 kg/h: the boiler shall be made of AISI304 stainless steel, openable for maintenance; models 20-80 kg/h: the boiler shall be made of AISI304 stainless steel, with the lid and a bottom front inspection panel removable for easy servicing;\n• Embedded conductimeter for the automatic management of the dilution drains and subsequent fills according to the supply water quality;\n• SSR’s (solid-state relays) for precise modulation of the steam production by dosing the power fed to the water;\n• Patented antifoam algorithm (AFS) to prevent irregular operation due to the formation of foam inside the cylinder;\n• The steam generator shall also have twin sensing electrodes for detection of water foaming and high limit water level;\n• Boiler thermal coating to reduce the heat loss;\n• Thermal shock feature, removing lime scale from the heating elements, extends the cleaning intervals and makes maintenance quicker;\n• Kevlar limescale bag inside the boiler for easy and quick maintenance (up to 13kg/h); doesn’t need any additional gaskets;\n• Boiler’s water temperature probe (NTC);\n• Pre-heating to keep the water warm in order to reduce the time to production (user-editable pre-heating set point);\n• The humidifier shall limit the steam production based on a proportional hi-limit probe that is self-adjusting according to AHU/duct air flow;\n• Humidifier shall have built-in power transformer, no needs of neutral line on power supply or additional external transformer;\n• Metallic housing with cover removable to allow full front access for easy maintenance;\n• Electrical section separated by a division wall and including the power circuitry and the control components, manufactured according to state-of-the-art norms;\n• The built-in USB port can be used for easy software updates, log file and alarm history extraction. Copy and paste parameters between units;\n• ON/OFF digital input for remote enabling;\n• Intelligent microprocessor controller with algorithm that automatically adapts operation to the water quality;\n• 4 built-in relays for remote signalling of: alarm relay, unit status relay (steam production), unit on/off, fan blower relay;\n• The type of electric signal shall be selectable via keyboard among: on/off (humidistat), 0…10 V, 2…10 V, 0…1 V, 0…20 mA, 4…20 mA and NTC (in case of temperature regulation); \n• RS485 serial port ready to communicate on Modbus, Bacnet or CAREL protocol for supervisory system. Without any additional devices;\n• Ethernet port ready to communicate on Modbus or Bacnet protocol for supervisory system.  Without any additional devices;\n• Strat-up wizard for simple step-by-step machine configuration during first commissioning;\n• Type of controller: control with 9 algorithms always available to the user: on/off, production proportional to an external demand,  production proportional to an external demand with modulating limiting probe, built-in %rH regulator with ambient probe, built-in %rH regulator with ambient probe and modulating limiting probe, built-in %rH regulator with two ambient probes (average), built-in temperature (°C/°F) regulator with ambient probe, built-in temperature (°C/°F) regulator with two ambient probes (average), built-in temperature (°C/°F) regulator with ambient and modulating limiting probe;\n• Master-slave capability to extend the capacity with automatic rotation of units;\n• Integrated backup of the unit for applications that require continuous service and non-stop humidification; \n• Maintenance backup to automatic start the second unit during the sevices; \n• Management of wireless probes (up to 4 ) to avoid cables into the building. User-editable of probes weight;\n• Plug&play web server for monitoring and setting of unit from remote position;\n• Keyboard to change the displayed value, edit the system parameters, reset the alarms;\n• Display of the supply water conductivity;\n• Selection of the units of measure (SI or Imperial);\n• Automatic check of valve, pump, water level sensor, presence of supply water at the start-up;\n• Automatic management of the lack of supply water with automatic restart when the water is available again;\n• Automatic maintenance warning;\n• Drain pump for full range of capacity (2…80 kg/h) that helps to remove debris;\n• The boiler shall be automatically emptied in case of prolonged inactivity, with the inactivity time-out being user-editable;\n• Compliances: CE, ETL, TÜV PRODUCT SERVICE, EAC;\n\n\n• [optional] wall-mounting %rH probe for civil environment (10 %rH … 90 %rH)\n• [optional] %rH & temperature industrial probe min. IP54 (0 %rH … 100 %rH, -10T70 °C)\n• [optional] %rH probe for duct min. IP40 (10 %rH … 90 %rH)\n• [optional] %rH limit probe for duct min. IP40 (0 %rH … 100 %rH)\n","heaterSteam Testi per Capitolati (UR*3 titanium)\n\nheaterSteam UR*3 titanium\n\nUmidificatore a resistenze immerse per ambiente e UTA/condotta che utilizza acqua potabile di rete,  acqua demineralizzata o acqua deionizzata. L’umidificatore riscalda e fa bollire l’acqua all’interno di un cilindro in acciaio inox. Il vapore generato è igienicamente puro (asettico). \n\nSpecifiche tecniche: \nProduzione nominale di vapore …………….………kg/h\nPotenza di ingresso nominale …………………………..kW\nTensione di alimentazione …………..…………………..VAC 1-phase / 3-phase\nNumero di uscite vapore …….…………………….\nDiametro uscite vapore ……………….……..mm\nPressione del vapore……………….………….…..Pa\nConnessione acqua …………..…3/4” G MALE\nScarico acqua…………….……………..……40 mm\n\nAccessori per installazione in condotta:\n- Distributore di vapore in acciaio inox AISI304 con flangia di connessione e drenaggio condensa;  lunghezza…….mm\n- Ugello di distribuzione del vapore\nAccessori per installazione in ambiente:\n- Distributore di vapore ventilato, box di metallo e deflettore per regolazione del flusso di vapore nell’ambiente.\n\nL’umidificatore deve avere le seguenti caratteristiche (2, 4, 6, 10, 13, 20, 27, 40, 53, 60, 80 kg/h):\n• Resistenze elettriche in titanio a bassa resistenza termica a garanzia di una veloce e stabile produzione di vapore e a sicurezza contro le sovratemperature;\n• Sensore di livello per un controllo preciso del livello dell’acqua nel cilindro per l’intero range di conducibilità 0…1500µS/cm, senza nessuna variazione o aggiunta di dispositivi esterni;\n• Ogni resistenza elettrica deve avere una sonda PTC per rilevare la temperatura e proteggere gli elementi riscaldanti dalle sovratemperature  (brevetto) \n• Precisione del controllo dell’umidità programmabile (± 1 %rH). \n• La regolazione della capacità deve essere impostabile nell’intervallo 0..100% della capacità nominale \n• L’umidificatore deve essere utilizzabile con ogni tipo d’acqua: di rete, demineralizzata, deionizzata o addolcita (≤1µS/cm è richiesto heaterSteam titanium);\n• Protezione da sovratemperatura sul coperchio del boiler (klixon, UR020-UR080);\n• modelli 2-13 kg/h: il cilindro in acciaio AISI 304 deve essere apribile per la manutenzione; modelli 20-80 kg/h: il cilindro deve essere in acciaio AISI304 e apribile: il coperchio e il pannello frontale inferiore (pannello di ispezione) devono essere rimovibili per una facile manutenzione;\n• Conducimetro integrato per una gestione automatica degli scarichi per diluizione e conseguenti carichi in base alla qualità dell’acqua;\n• Relè allo stato solido SSR (solid-state relay) per una modulazione precisa della produzione del vapore dosando la potenza;\n• Algoritmo anti-schiuma (AFS – Anti Foam System) per prevenire un’irregolare produzione dell’umidificatore a causa della formazione di schiuma nel cilindro (brevetto Carel);\n• Il generatore di vapore dovrà inoltre avere un doppio sensore a elettrodi per determinare l’eventuale schiuma nell’acqua e livello limite dell’acqua;\n• isolamento termico del boiler per ridurre le perdite di calore;\n• Funzione di shock termico per rimuovere il calcare dagli elementi riscaldanti, la funzione riduce la pulizia rendendo più facile la manutenzione;\n• per modelli da 2 a 13 kg/h: sacco in kevlar (riutilizzabile) interno al cilindro per una facile e veloce pulizia; non necessita di guarnizioni aggiuntive;\n• Sonda di temperatura NTC per l’acqua del boiler;\n• Funzione di pre-riscaldo per ridurre il tempo di produzione (set point di pre-riscaldo programmabile);\n• L’umidificatore deve poter limitare la produzione di vapore in base a una sonda limite proporzionalmente e in modo autoadattativo alla portata d’aria della UTA/condotta;\n• L’umidificatore deve essere dotato di trasformatore interno, non si necessita della linea del neutro per l’alimentazione o di un trasformatore esterno addizionale;\n• Carpenteria metallica con pannello frontale rimovibile per un facile accesso durante la manutenzione;\n• Sezione elettrica dedicata e separata da specifica parete che comprende circuito elettrico e componenti di controllo, realizzata a stato dell’arte;\n• La porta USB a bordo deve poter essere utilizzata per un aggiornamento del software, salvataggio dei log delle variabile e per l’esportazione dello storico allarme.  Inoltre, possibilità di esportare e importare i valori dei parametri tra le unità;\n• Ingresso digitale di tipo ON/OFF per attivazione/disattivazione da remoto;\n• Controllo delle operazioni con algoritmo autoadattativo in base alla qualità dell’acqua;\n• 4 relè a bordo per la segnalazione remota di: segnale di allarme, stato unità (produzione vapore), unità on/off, relè per la testata ventilante;\n• Il tipo di segnale deve essere selezionabile da interfaccia utente tra: on/off (umidostato), 0…10 V, 2…10 V, 0…1 V, 0…20 mA, 4…20 mA e NTC (in caso di regolazione in temperatura);\n• Porta seriale RS485 per comunicazione con dispositivi CAREL, Modbus® e Bacnet. Senza l’aggiunta di dispositivi esterni;\n• Porta Ethernet per comunicazione con dispositive Modbus® o Bacnet. Senza l’aggiunta di dispositivi esterni;\n• Strat-up wizard per facile configurazione dell’unità a step durante il primo avvio;\n• Tipo di regolazione: controllo con 9 tipi di algoritmi sempre a disposizione dell’utente: on/off, produzione proporzionale ad una richiesta esterna, produzione proporzionale ad una richiesta esterna con sonda limite modulante, regolazione integrata %rH con sonde ambiente e sonda limite modulante, regolazione integrata %rH con due sonde ambiente (media), regolazione integrata in temperatura (°C/°F) con sonda ambiente, regolazione integrata in temperatura (°C/°F) con due sonde ambiente (media), regolazione integrata in temperatura (°C/°F) con sonda ambiente e sonda limite;\n• Funzione Master-slave per estendere la capacità di vapore con rotazione automatica delle unità;\n• Funzione di backup delle unità integrata per applicazioni che richiedono servizio continuativo ed evitare fermi macchina per la manutenzione;\n• Funzione di backup per manutenzione per attivazione automatica di una seconda unità durante la manutenzione;\n• Gestione di sonde wireless (fino a 4) per evitare il cablaggio negli edifici. Definizione del peso delle sonde da parte dell’utente;\n• Plug&Play web server per monitoraggio e impostazione dell’unità da posizione remota;\n• Tastiera per cambiare valore in visualizzazione, per settare i parametri, e resettare gli allarmi;\n• Visualizzazione della conducibilità dell’acqua di ingresso;\n• Selezione delle unità di misura (SI o Imperial);\n• Controllo automatico della valvola, pompa, sensore di livello acqua, presenza di acqua di ingresso durante l’avviamento dell’umidificatore;\n• Gestione automatica della mancanza di acqua di ingresso con riavvio automatico quando l’acqua è presente nuovamente;\n• Messaggi automatici di manutenzione;\n• Pompa di drenaggio acqua sull’intero range di capacità (2…80kg/h) per un facile scarico dei residui di calcare;\n•  Il cilindro devono essere automaticamente svuotati dall’acqua nel caso di prolungata inattività, il time-out deve essere programmabile dall’utente;\n• compliances: CE, ETL, TÜV PRODUCT SERVICE, EAC;\n\n\n• [Opzionale] sonda di umidità %rH a muro per applicazioni civili (10 %rH … 90 %rH)\n• [Opzionale] sonda di umidità %rH  e di temperatura per applicazioni industriali IP54 (0 %rH … 100 %rH, -10T70 °C)\n• [Opzionale] sonda di umidità %rH  per condotta IP40 (10 %rH … 90 %rH)\n• [Opzionale] sonda limite di umidità %rH per condotta IP40 (0 %rH … 100 %rH)\n","humiSteam TESTO per capitolato\n\n\nUmidificatore isotermico a vapore per ambiente e condotta ad elettrodi immersi in acqua potabile di rete (1.5, 3, 5, 8, 9, 10, 15, 18, 25, 35, 45, 65, 90, 130 kg/h).\n\nI modelli modulanti UE*X* devono avere le seguenti caratteristiche (1.5, 3, 5, 8, 9, 10, 15, 18, 25, 35, 45, 65, 90, 130 kg/h):\n- conformità CE, CETLUS, TÜV PRODUCT SERVICE, PCT\n- copertura in lamiera pressopiegata e pre-verniciata facilmente rimuovibile frontalmente per le operazioni d’assistenza e manutenzione\n- vano elettrico separato da setto metallico e comprendente la circuiteria di potenza e i componenti di regolazione e controllo, cablato a regola d’arte secondo le vigenti normative di sicurezza\n- cilindri di serie usa-e-getta in materiale plastico HB secondo UL94  oppure cilindri apribili e pulibili di tipo V0 secondo UL94\n- acqua di carico: di rete, potabile (range minimo di conducibilità accettabile 75 – 1250 µS/cm)\n- elettrodi immersi in acciaio zincato ad elevata superficie di scambio\n- pompa di scarico\n- vasca di raccolta sul fondo per prevenire allagamenti in casi di eventuali perdite d’acqua\n- conducimetro integrato per una gestione completamente automatica di carichi e scarichi in funzione del tipo d’acqua di alimentazione\n- ingresso digitale ON/OFF per l’abilitazione remota\n- relè cumulativo di allarme per la segnalazione remota di guasti e/o malfunzionamenti\n- due ingressi analogici per segnale esterno di richiesta e sonde: gli ingressi sono impostabili da tastiera per segnale di tipo on/off (umidostato), 0…10 V, 2…10 V, 0…1 V, 0…20 mA, 4…20 mA, 0-135 Ohm, 135-10000 Ohm, NTC\n- possibilità di collegare una sonda limite per evitare di bagnare la condotta\n- porta seriale RS485 predisposta per la comunicazione con i sistemi CAREL o via Modbus® RTU\n- controllo pHC (famiglia pCO) con display grafico per messaggistica ad icone di facile ed immediata comprensione e con algoritmi di regolazione auto-adattantesi alla qualità dell’acqua\n- controllore con 6 algoritmi di regolazione attivabili in ogni momento: on/off, proporzionale da segnale esterno, proporzionale da segnale esterno e sonda modulante limite, regolatore integrato di umidità con sonda ambiente, regolatore integrato di umidità con sonda ambiente e sonda modulante limite, regolatore integrato di temperatura per bagni turchi\n- display grafico remotabile fino a 50 m senza alimentatore esterno (fino a 200 m con alimentatore esterno) per la visualizzazione della richiesta di produzione, misura della sonda ambientale, misura della sonda limite, produzione istantanea di vapore, allarmi, parametri di sistema\n- tastiera per cambiare la visualizzazione a display, modificare i parametri di sistema, azzerare gli allarmi\n- impostazione manuale e modulazione della massima portata di vapore dal 20% al 100% della portata nominale (dal 10% per le unità da 90 e 130 kg/h)\n- algoritmo antischiuma brevettato (AFS) per prevenire l’irregolarità di funzionamento dovuto alla formazione di schiuma all’interno del cilindro\n- definizione di fasce orarie per l’on/off giornaliero e settimanale\n- definizione di max. 4 set point in funzione dell’ora del giorno\n- visualizzazione della conducibilità dell’acqua di alimentazione\n- scelta della lingua\n- scelta del sistema di unità di misura (SI o Imperiale)\n- scelta della logica del relè d’allarme (NO o NC)\n- storico allarmi (200 allarmi)\n- disabilitazione anche da tastiera\n- gestione della mancanza d’acqua di alimentazione con ripartenza automatica in caso di ritornata disponibilità\n- auto-diagnosi iniziale automatica\n- avvisi di manutenzione automatici e temporizzati (questi ultimi impostabili a seconda delle esigenze)\n- svuotamento automatico del cilindro bollitore in caso di fermo prolungato (impostabile) per evitare la formazione di acqua stagnante\n- svuotamento periodico del cilindro bollitore (impostabile) per rimuovere i fanghi che si formano con acqua ricche di sostanze in sospensione (per esempio, humus)\n- start/stop di un de-umidificatore esterno in base a un set point di umidità impostabile\n- attivazione manuale delle uscite digitali per manutenzione\n- modelli da 90 e 130 kg/h con 2 cilindri: selezione del funzionamento in serie o in parallelo dei due cilindri\n- optional: comunicazione con BMS LON®, BACnet™ over Ethernet, BACnet™ over IP, BACnet™ over MS/TP, TCP/IP, SNMP, DHCP, HTTP, FTP\n- optional: diagnostica remota via GSM\n- optional: sonda di umidità a muro per ambiente civile (10 %rH … 90 %rH)\n- optional: sonda di umidità/temperatura a muro per ambiente industriale min. IP54 (0 %rH … 100 %rH, -10T70 °C)\n- optional: sonda di umidità per condotta min. IP40 (10 %rH … 90 %rH)\n- sonda di umidità limite per condotta min. IP40 (0 %rH … 100 %rH)\n- optional: sonda di temperatura universale min. IP55 (-30T90 °C)\n\nI modelli modulanti UE*W* per bagni turchi devono avere le seguenti caratteristiche (1.5, 3, 5, 8, 9, 10, 15, 18, 25, 35, 45, 65 kg/h):\n- conformità CE, CETLUS, TÜV PRODUCT SERVICE, PCT\n- copertura in lamiera pressopiegata e pre-verniciata facilmente rimuovibile frontalmente per le operazioni d’assistenza e manutenzione\n- vano elettrico separato da setto metallico e comprendente la circuiteria di potenza e i componenti di regolazione e controllo, cablato a regola d’arte secondo le vigenti normative di sicurezza\n- cilindri usa-e-getta in materiale plastico HB secondo UL94 di serie\n- cilindri apribili e pulibili di tipo V0 secondo UL94 ordinabili a parte\n- elettrodi immersi in acciaio zincato ad elevata superficie di scambio\n- conducimetro integrato per una gestione completamente automatica di carichi e scarichi in funzione del tipo d’acqua di alimentazione\n- ingresso digitale ON/OFF per l’abilitazione remota\n- relè cumulativo di allarme per la segnalazione remota di guasti e/o malfunzionamenti\n- due ingressi analogici per segnale esterno di richiesta e sonde: gli ingressi sono impostabili da tastiera per segnale di tipo on/off (umidostato), 0…10 V, 2…10 V, 0…1 V, 0…20 mA, 4…20 mA, NTC e 0-135 Ohm\n- porta seriale RS485 predisposta per la comunicazione con i sistemi CAREL o via Modbus® RTU\n- controllo pHC (famiglia pCO) con display grafico per messaggistica ad icone di facile ed immediata comprensione\n- controllore con algoritmo di regolazione della temperatura in base alla lettura di max 2 sonde di temperatura ed auto-adattantesi alla qualità dell’acqua\n- le letture delle 2 sonde di temperatura possono essere mediate con 2 pesi diversi\n- display grafico remotabile fino a 50 m senza alimentatore esterno (fino a 200 m con alimentatore esterno) per la visualizzazione della richiesta di produzione, misura della sonda ambientale, misura della sonda limite, produzione istantanea di vapore, allarmi, parametri di sistema\n- tastiera per cambiare la visualizzazione a display, modificare i parametri di sistema, azzerare gli allarmi\n- impostazione manuale e modulazione della massima portata di vapore dal 20% al 100% della portata nominale\n- start/stop di 3 pompe esterne per essenze con tempistiche definibile dall’utente\n- start/stop di una pompa esterna per il ciclo di sanificazione impostabile dall’utente\n- gestione di 2 ventilatori (immissione ed estrazione)\n- on/off della luce interna\n- algoritmo antischiuma brevettato (AFS) per prevenire l’irregolarità di funzionamento dovuto alla formazione di schiuma all’interno del cilindro\n- definizione di fasce orarie per l’on/off giornaliero e settimanale\n- definizione di max. 4 set point in funzione dell’ora del giorno\n- visualizzazione della conducibilità dell’acqua di alimentazione\n- scelta della lingua\n- scelta del sistema di unità di misura (SI o Imperiale)\n- scelta della logica del relè d’allarme (NO o NC)\n- storico allarmi (200 allarmi)\n- disabilitazione anche da tastiera\n- gestione della mancanza d’acqua di alimentazione con ripartenza automatica in caso di ritornata disponibilità\n- auto-diagnosi iniziale automatica\n- avvisi di manutenzione automatici e temporizzati (questi ultimi impostabili a seconda delle esigenze)\n- svuotamento automatico del cilindro bollitore in caso di fermo prolungato (impostabile) per evitare la formazione di acqua stagnante\n- svuotamento periodico del cilindro bollitore (impostabile) per rimuovere i fanghi che si formano con acqua ricche di sostanze in sospensione (per esempio, humus)\n- start/stop di un de-umidificatore esterno in base a un set point di umidità impostabile\n- attivazione manuale delle uscite digitali per manutenzione\n- optional: comunicazione con BMS LON®, BACnet™ over Ethernet, BACnet™ over IP, BACnet™ over MS/TP, TCP/IP, SNMP, DHCP, HTTP, FTP\n- optional: diagnostica remota via GSM\n- optional: sonda di umidità/temperatura a muro per ambiente industriale min. IP54 (0 %rH … 100 %rH, -10T70 °C)\n- optional: sonda di temperatura universale min. IP55 (-30T90 °C)\n\nI modelli modulanti UE*Y* devono avere le seguenti caratteristiche (1.5, 3, 5, 8, 9, 10, 15, 18, 25, 35, 45, 65kg/h):\n- conformità CE, CETLUS, TÜV PRODUCT SERVICE, PCT\n- copertura in lamiera pressopiegata e pre-verniciata facilmente rimuovibile frontalmente per le operazioni d’assistenza e manutenzione\n- vano elettrico separato da setto metallico e comprendente la circuiteria di potenza e i componenti di regolazione e controllo, cablato a regola d’arte secondo le vigenti normative di sicurezza\n- cilindri di serie usa-e-getta in materiale plastico HB secondo UL94 oppure apribili e pulibili di tipo V0 secondo UL94\n- acqua di carico: di rete, potabile (range minimo di conducibilità accettabile 75 – 1250 µS/cm)\n- elettrodi immersi in acciaio zincato ad elevata superficie di scambio\n- pompa di scarico\n- vasca di raccolta sul fondo per prevenire allagamenti in casi di eventuali perdite d’acqua\n- conducimetro integrato per una gestione completamente automatica di carichi e scarichi in funzione del tipo d’acqua di alimentazione\n- ingresso digitale ON/OFF per l’abilitazione remota\n- relè cumulativo di allarme per la segnalazione remota di guasti e/o malfunzionamenti\n- un ingresso analogico per segnale esterno di richiesta: l’ingresso è impostabile da tastiera per segnale di tipo on/off (umidostato), 0…10 V, 2…10 V, 0…20 mA e 4…20 mA\n- porta seriale RS485 predisposta per la comunicazione con i sistemi CAREL o via Modbus® RTU\n- controllo con terminale ad icone di facile ed immediata comprensione e con algoritmi di regolazione auto-adattantesi alla qualità dell’acqua\n- controllore con 2 algoritmi di regolazione attivabili in ogni momento: on/off e proporzionale da segnale esterno\n- terminale remotabile fino a 20 m per la visualizzazione della richiesta di produzione, produzione istantanea di vapore, allarmi, parametri di sistema\n- tastiera per cambiare la visualizzazione a display, modificare i parametri di sistema, azzerare gli allarmi\n- impostazione manuale e modulazione della massima portata di vapore dal 20% al 100% della portata nominale\n- algoritmo antischiuma brevettato (AFS) per prevenire l’irregolarità di funzionamento dovuto alla formazione di schiuma all’interno del cilindro\n- visualizzazione della conducibilità dell’acqua di alimentazione\n- scelta del sistema di unità di misura (SI o Imperiale)\n- scelta della logica del relè d’allarme (NO o NC)\n- storico allarmi (200 allarmi)\n- gestione della mancanza d’acqua di alimentazione con ripartenza automatica in caso di ritornata disponibilità\n- auto-diagnosi iniziale automatica\n- avvisi di manutenzione automatici e temporizzati (questi ultimi impostabili a seconda delle esigenze)\n- svuotamento automatico del cilindro bollitore in caso di fermo prolungato (impostabile) per evitare la formazione di acqua stagnante\n- svuotamento periodico del cilindro bollitore (impostabile) per rimuovere i fanghi che si formano con acqua ricche di sostanze in sospensione (per esempio, humus)\n\nCaratteristiche tecniche principali:\n- Produzione nominale Max di vapore ………kg/h\n- Potenza elettrica assorbita…………………..kW\n- Tensione d’alimentazione…………………..VAC 1-fase / 3-fase\n- Numero di uscite vapore…………………….\n- Diametro uscita vapore……………….……..mm\n- Pressione Max d’uscita vapore………….…..Pa\n- Attacco acqua di alimentazione…………..…3/4” G MASCHIO\n- Scarico acqua…………….……………..……40 mm\n\nAccessori per installazione in condotta:\n- Distributore lineare forato in acciaio inox AISI304 completo di staffa di fissaggio e raccordo di drenaggio condensa; lunghezza …….mm\n- Ugello diffusore in materiale plastica\n\nAccessori per installazione in ambiente:\n- Distributore di vapore ventilato, costituito da carpenteria in lamiera verniciata contenente ventilatore e deflettore regolabile per una corretta ed uniforme distribuzione del vapore in ambiente.\n","humiSteam standard Tender text\n \nImmersed-electrodes steam humidifier for ambient and AHU/duct using drinkable mains water (1.5, 3, 5, 8, 9, 10, 15, 18, 25, 35, 45, 65, 90, 130 kg/h).\nModulating models UE*X*\nModulating models UE*X* shall have the following characteristics (1.5, 3, 5, 8, 9, 10, 15, 18, 25, 35, 45, 65, 90, 130 kg/h):\n• compliances: CE, CETLUS, TÜV PRODUCT SERVICE, PCT\n• metallic housing with cover removable to allow 180° front access for easy maintenance\n• electric section separated by a divider wall and including the power circuitry and the control components, manufactured according to the state-of-the-art norms\n• standard cylinder: disposable cylinder, rated HB according to UL 94, or cleanable cylinder, rated V0 according to UL 94\n• supply water: from mains, drinkable, conductivity range (min) 75 – 1250 µS/cm\n• drain pump\n• bottom pan that collects and drains small leaks\n• immersed electrodes made of galvanized steel with high contact surface\n• embedded conductimetre for the automatic management of the dilution drains and subsequent fills according to the supply water quality\n• ON/OFF digital input for remote enabling\n• cumulative alarm relay for the remote signalling of faults and/or malfunctions\n• 2 analogue inputs for probes and external demand. The type of electrical signal for both shall be selectable via keyboard among: on/off (humidistat), 0…10 V, 2…10 V, 0…1 V, 0…20 mA, 4…20 mA, 0-135 Ohm, 135-10000 Ohm, NTC\n• RS485 serial port ready to communicate with CAREL devices or via Modbus® RTU\n• pHC control (pCO family) with user-friendly graphic display (icons and messages readily understandable) and with algorithms that automatically adapt the operations to the water quality\n• controller with 6 algorithms always available to the user: on/off, production proportional to an external demand, production proportional to an external demand and modulating limiting probe, built-in %rH controller with ambient probe, built-in %rH controller with ambient probe and modulating limiting probe, built-in temperature controller with ambient probe\n• graphic display remotable up to 50 m without external power supply (200 m with external power supply) to show demand, ambient probe reading, limit probe reading, steam production, alarms, system parameters\n• keyboard to change the displayed value, edit the system parameters, reset the alarms\n• maximum production can be manually set from 20% to 100% of the rated production (from 10% for models 90 and 130 kg/h)\n• patented antifoam algorithm (AFS) to prevent irregular operation due to the formation of foam inside the cylinder\n• daily and weekly on/off timers\n• up to 4 different daily automatic set points shall be editable\n• display of the supply water conductivity\n• selection of the language\n• selection of the units of measure (SI or Imperial)\n• the relay logic shall be selectable (NO or NC)\n• alarm history (200 alarms)\n• the humidifier shall also be enabled/disabled from the keyboard\n• automatic management of the lack of supply water with automatic restart when the water is available again\n• automatic initial self-test\n• maintenance warnings and alarms, both automatic and timed (the latter can be set by the user)\n• the boiler(s) shall be automatically emptied in case of prolonged inactivity, with the inactivity time-out user-editable\n• periodical flush (user-editable) to remove deposits that build up with turbid water (e.g., humus)\n• start/stop of an external de-humidifier according to a user-editable %rH set point\n• it shall be possible to force each digital output for servicing\n• models 90 and 130 kg/h with 2 boilers: selection between sequence and parallel duty of the boilers\n• optional: communication via LON®, BACnet™ over Ethernet, BACnet™ over IP, BACnet™ over MS/TP, TCP/IP, SNMP, DHCP, HTTP, FTP\n• optional: remote diagnostic via GSM\n• optional: wall-mounting %rH probe for civil environment (10 %rH … 90 %rH)\n• optional: %rH & temperature industrial probe min. IP54 (0 %rH … 100 %rH, -10T70 °C)\n• optional: %rH probe for duct min. IP40 (10 %rH … 90 %rH)\n• optional: %rH limit probe for duct min. IP40 (0 %rH … 100 %rH)\n• optional: temperature probe min. IP55 (-30T90 °C)\n\nModulating models UE*W*\nModulating models UE*W* dedicated to steam baths shall have the following characteristics (1.5, 3, 5, 8, 9, 10, 15, 18, 25, 35, 45, 65 kg/h):\n• compliances: CE, CETLUS, TÜV PRODUCT SERVICE, PCT\n• metallic housing with cover removable to allow 180° front access for easy maintenance\n• electric section separated by a divider wall and including the power circuitry and the control components, manufactured according to the state-of-the-art norms\n• disposable cylinder as standard, rated HB according to UL 94\n• cleanable cylinder as optional, rated V0 according to UL 94\n• immersed electrodes made of galvanized steel with high contact surface\n• embedded conductimetre for the automatic management of the dilution drains and subsequent fills according to the supply water quality\n• ON/OFF digital input for remote enabling\n• cumulative alarm relay for the remote signalling of faults and/or malfunctions\n• 2 analogue inputs for probes and external demand. The type of electrical signal for both shall be selectable via keyboard among: on/off (humidistat), 0…10 V, 2…10 V, 0…1 V, 0…20 mA and 4…20 mA\n• RS485 serial port ready to communicate with CAREL devices or via Modbus® RTU\n• pHC control (pCO family) with user-friendly graphic display (icons and messages readily understandable)\n• the control is for temperature only by means of 1 or 2 temperature probes and automatically adapts the operations to the water quality\n• the readings of the 2 probes shall be averaged and the weighs of the average shall be user editable\n• graphic display remotable up to 50 m without external power supply (200 m with external power supply) to show demand, ambient probe reading, limit probe reading, steam production, alarms, system parameters\n• keyboard to change the displayed value, edit the system parameters, reset the alarms\n• maximum production can be manually set from 20% to 100% of the rated production\n• start/stop of up to 3 external pump essences with user-editable timings\n• start/stop of an external sanitizer pump with user-editable timings\n• start/stop of 2 fans\n• on/off of the internal light\n• patented antifoam algorithm (AFS) to prevent irregular operation due to the formation of foam inside the cylinder\n• daily and weekly on/off timers\n• up to 4 different daily automatic set points shall be editable\n• display of the supply water conductivity\n• selection of the language\n• selection of the units of measure (SI or Imperial)\n• the relay logic shall be selectable (NO or NC)\n• alarm history (200 alarms)\n• the humidifier shall also be enabled/disabled from the keyboard\n• automatic management of the lack of supply water with automatic restart when the water is available again\n• automatic initial self-test\n• maintenance warnings and alarms, both automatic and timed (the latter can be set by the user)\n• the boiler(s) shall be automatically emptied in case of prolonged inactivity, with the inactivity time-out user-editable\n• periodical flush (user-editable) to remove deposits that build up with turbid water (e.g., humus)\n• start/stop of an external de-humidifier according to a user-editable %rH set point\n• it shall be possible to force each digital output for servicing\n• optional: communication via LON®, BACnet™ over Ethernet, BACnet™ over IP, BACnet™ over MS/TP, TCP/IP, SNMP, DHCP, HTTP, FTP\n• optional: remote diagnostic via GSM\n• optional: %rH & temperature industrial probe min. IP54 (0 %rH … 100 %rH, -10T70 °C)\n• optional: temperature probe min. IP55 (-30T90 °C)\n\nModulating models UE*Y*\nModulating models UE*Y* shall have the following characteristics (1.5, 3, 5, 8, 9, 10, 15, 18, 25, 35, 45, 65 kg/h):\n• compliances: CE, CETLUS, TÜV PRODUCT SERVICE, PCT\n• metallic housing with cover removable to allow 180° front access for easy maintenance\n• electric section separated by a divider wall and including the power circuitry and the control components, manufactured according to the state-of-the-art norms\n• standard cylinder: disposable cylinder, rated HB according to UL 94, or cleanable cylinder, rated V0 according to UL 94\n• supply water: from mains, drinkable, conductivity range (min) 75 – 1250 µS/cm\n• drain pump\n• bottom pan that collects and drains small leaks\n• immersed electrodes made of galvanized steel with high contact surface\n• embedded conductimetre for the automatic management of the dilution drains and subsequent fills according to the supply water quality\n• ON/OFF digital input for remote enabling\n• cumulative alarm relay for the remote signalling of faults and/or malfunctions\n• 1 analogue input for the external demand. The type of electrical signal shall be selectable via keyboard among: on/off (humidistat), 0…10 V, 2…10 V, 0…20 mA and 4…20 mA\n• RS485 serial port ready to communicate with CAREL devices or via Modbus® RTU\n• user-friendly terminal with display with icons and with algorithms that automatically adapt the operations to the water quality\n• controller with 2 algorithms always available to the user: on/off and production proportional\n• terminal remotable up to 20 m to show demand, steam production, alarms, system parameters\n• keyboard to change the displayed value, edit the system parameters, reset the alarms\n• maximum production can be manually set from 20% to 100% of the rated production \n• patented antifoam algorithm (AFS) to prevent irregular operation due to the formation of foam inside the cylinder\n• display of the supply water conductivity\n• selection of the units of measure (SI or Imperial)\n• the relay logic shall be selectable (NO or NC)\n• alarm history (200 alarms)\n• automatic management of the lack of supply water with automatic restart when the water is available again\n• automatic initial self-test\n• maintenance warnings and alarms, both automatic and timed (the latter can be set by the user)\n• the boiler(s) shall be automatically emptied in case of prolonged inactivity, with the inactivity time-out user-editable\n• periodical flush (user-editable) to remove deposits that build up with turbid water (e.g., humus)\nMain technical specs:\nRated steam production …………….………kg/h\nRated power input …………………………..kW\nPower supply …………..…………………..VAC 1-phase / 3-phase\nNo. of steam outlets …….…………………….\nSteam outlet diameter ……………….……..mm\nSteam pressure……………….………….…..Pa\nSupply water connection…………..…3/4” G MALE\nDrain connection…………….……………..……40 mm\n\nAccessories for duct installations:\nSteam lance made of AISI304 with fitting flange and condensate outlet; length …….mm\nSteam nozzle distributor\n\nAccessories for ambient installations:\nSteam distributor with embedded blower, powder-painted metallic enclosure and air flow deflector for an even distribution of the steam into the ambient.\n","gaSteam CAREL testo per capitolato\n\n\nUmidificatore isotermico a vapore per ambiente e AHU/condotta alimentato a gas ed\nacqua potabile di rete o demineralizzata (45, 90, 180 kg/h).\nCaratteristiche generali:\n• conformità CE, TÜV DVGW, CETLUS, AGA per la scheda di controllo fiamma\n• copertura in lamiera di acciaio pressopiegata e verniciata a polvere facilmente rimuovibile sia frontalmente sia lateralmente sia superiormente per le operazioni d’assistenza e manutenzione\n• vano elettrico e treno gas separato da setto metallico e comprendente la circuiteria di potenza e i componenti di regolazione e controllo, cablato a regola d’arte secondo le vigenti normative di sicurezza\n• boiler per la produzione di vapore in acciaio inox AISI 304 L ispezionabile: coperchio e flangia frontale inferiore rimuovibili per la pulizia del calcare e la manutenzione\n• il boiler deve avere un rivestimento termico esterno per limitare le dispersioni termiche\n• scambiatore di calore ad alto rendimento in acciaio inox AISI 316 L; composto da 4 elementi affiancati per 45 kg/h e 7 elementi affiancati per 90/180 kg/h.\n• adattabilità a vari tipi di gas (metano G20 e G25, propano (gpl) G31) per mezzo di una semplice modica di parametri del controllore\n• bruciatore pre-mix a pressione negativa con soffiante modulante ed efficienza dal 92% al 95% a seconda del modello\n• emissioni di NOX: classe 5 per i modelli 45, 90 e 180 kg/h\n• sonda NTC per la misura della temperatura fumi e blocco in caso di sovratemperatura\n• klixon di sicurezza a riarmo manuale in caso di sovratemperatura fumi\n• sensore per il controllo preciso del livello dell’acqua\n• conducimetro integrato per una gestione completamente automatica di carichi e scarichi in funzione del tipo d’acqua di alimentazione\n• due ingressi analogici per segnale esterno di richiesta e sonde: gli ingressi sono impostabili da tastiera per segnale di tipo on/off (umidostato), 0…10 V, 2…10 V, 0…1 V, 0…20 mA, 4…20 mA, NTC, 0-135 Ohm\n• sonda di temperatura acqua\n• ingresso digitale ON/OFF per l’abilitazione remota\n• relè cumulativo di allarme per la segnalazione remota di guasti e/o malfunzionamenti\n• replica della produzione di vapore per mezzo di un’uscita 0-10 V dedicata per eventuali dispositivi esterni\n• porta seriale RS485 predisposta per la comunicazione con i sistemi CAREL o via Modbus®\n• controllo pHC (famiglia pCO) con display grafico per messaggistica ad icone di facile ed immediata comprensione e con algoritmi di regolazione auto-adattantesi alla qualità dell’acqua\n• 6 algoritmi di regolazione attivabili in ogni momento: on/off, proporzionale da segnale esterno, regolatore integrato di umidità con sonda ambiente, regolatore integrato di umidità con sonda ambiente e sonda modulante limite, regolatore integrato di temperatura per bagni turchi, regolazione proporzionale con segnale impostato da un controllore esterno e limite in umidità\n• display grafico remotabile fino a 50 m senza alimentatore esterno (fino a 200 m con alimentatore esterno) per la visualizzazione della richiesta di produzione, misura della sonda ambientale, misura della sonda limite, produzione istantanea di vapore, allarmi, parametri di sistema\n• tastiera per cambiare la visualizzazione a display, modificare i parametri di sistema, azzerare gli allarmi\n• impostazione manuale e modulazione della portata massima di vapore dal 25% al 100% della portata nominale (dal 12.5% per il modello da 180 kg/h)\n• algoritmo antischiuma brevettato (AFS) per prevenire l’irregolarità di funzionamento dovuto alla formazione di schiuma all’interno del boiler\n• definizione di fasce orarie per l’on/off giornaliero e settimanale\n• definizione di max. 4 set point in funzione dell’ora del giorno\n• visualizzazione della conducibilità dell’acqua di alimentazione\n• scelta della lingua\n• scelta del sistema di unità di misura (SI o Imperiale)\n• scelta della logica del relè d’allarme (NO o NC)\n• storico allarmi (200 allarmi con data e ora)\n• disabilitazione anche da tastiera\n• test automatico delle valvole, pompa e del sensore di livello dell’acqua all’avvio dell’umidificatore, compresa la verifica della presenza dell’acqua di alimentazione\n• auto-diagnosi iniziale automatica\n• avvisi di manutenzione automatici\n• gestione della mancanza d’acqua di alimentazione con ripartenza automatica in caso di ritornata disponibilità\n• pre-riscaldamento attivabile per mantenere l’acqua calda e ridurre i tempi di produzione del vapore\n• funzionalità antigelo automatica per l’acqua nel boiler\n• svuotamento automatico del cilindro bollitore in caso di fermo prolungato (impostabile) per evitare la formazione di acqua stagnante\n• stima delle incrostazioni calcaree con avvisi automatici di manutenzione in base alla temperatura fumi (NTC)\n• start/stop di un de-umidificatore esterno in base a un set point di umidità impostabile\n• attivazione manuale delle uscite digitali per manutenzione\n• modello da 180 kg/h con 2 bruciatori: selezione del funzionamento in serie o in parallelo dei due bruciatori\n• modello da 180 kg/h con 2 bruciatori: abilitazione della rotazione dei bruciatori per uniformità d’usura (a differenza di tempo impostabile durante il funzionamento o\nalla ripartenza)\n• optional: comunicazione con BMS LON®, BACnet™ over Ethernet, BACnet™ over IP, BACnet™ over MS/TP, TCP/IP, SNMP, DHCP, HTTP, FTP\n• optional: diagnostica remota via GSM\n• optional: sonda di umidità a muro per ambiente civile (10 %rH … 90 %rH)\n• optional: sonda di umidità/temperatura a muro per ambiente industriale min. IP54 (0 %rH … 100 %rH, -10T70 °C)\n• optional: sonda di umidità per condotta min. IP40 (10 %rH … 90 %rH)\n• sonda di umidità limite per condotta min. IP40 (0 %rH … 100 %rH)\n• optional: sonda di temperatura universale min. IP55 (-30T90 °C)\nCaratteristiche tecniche principali:\nProduzione nominale Max di vapore ………kg/h\nPortata termica ………………………………..kW\nGas G20/G25/G31\nClasse NOX 5 (UG045, UG090) / 4 (UG180)\nTensione d’alimentazione 230 VAC 1-fase, max 300 W\nNumero di uscite vapore…………………….\nDiametro uscita vapore 40 mm\nPressione Max d’uscita vapore 2000 Pa\nAttacco acqua di alimentazione 3/4” G MASCHIO\nScarico acqua…………….……………..……40 mm\nAccessori per installazione in condotta:\nDistributore lineare forato in acciaio inox AISI304 completo di staffa di fissaggio e\nraccordo di drenaggio condensa; lunghezza …….mm","gaSteam standard tender text\n\n\n\nGas-driven steam humidifier for ambient and AHU/duct using drinkable mains water or demineralised water (45, 90, 180 kg/h).\nGeneral specifications:\n• compliances: CE, TÜV DVGW, CETLUS, AGA for ignition flame control board\n• metallic housing with top, side and front panels removable to allow access for easy maintenance\n• electric section with gas train separated by a divider wall and including the power circuitry and the control components, manufactured according to the state-of-the-art norms\n• boiler made of AISI 304 L openable: the lid and the bottom front door shall be removable for easy maintenance\n• the boiler shall have a thermal coating to reduce the heat loss\n• high efficiency heat exchanger made of stainless steel AISI 316 L; shall be formed by 4 plates for 45 kg/h and 7 plates for 90/180 kg/h.\n• straightforward configuration for different gases (methane G20 & G25, propane (lpg) G31) by editing a small set of controller parameters\n• negative pressure pre-mix burner with modulatine blower and high efficiency (92% to 95% according to the model)\n• low NOX emissions: class 5 for models 45, 90 & 180 kg/h\n• NTC probe for reading the fumes temperature and block the humidifier in case of overheating\n• manual-reset safety klixon to detect fumes overheating\n• water level sensor for the precise control of the water level\n• embedded conductimetre for the automatic management of the dilution drains and subsequent fills according to the supply water quality\n• 2 analogue inputs for probes and external demand. The type of electrical signal for both shall be selectable via keyboard among: on/off (humidistat), 0…10 V, 2…10 V, 0…1 V, 0…20 mA, 4…20 mA, NTC, 0-135 Ohm\n• boiler’s water temperature probe\n• ON/OFF digital input for remote enabling\n• cumulative alarm relay for the remote signalling of faults and/or malfunctions\n• dedicated 0-10V output to replicate the steam production for an external device\n• connection via RS485 (CAREL devices only) and Modbus® readily available\n• pHC control (pCO family) with user-friendly graphic display (icons and messages readily understandable) and with algorithms that automatically adapt the operations to the water quality\n• 6 algorithms always available to the user: on/off, production proportional to an external demand, built-in %rH regulator with ambient probe, built-in %rH regulator with ambient probe and modulating limiting probe, built-in temperature regulator with ambient probe, Proportional control with signal set by an external controller and limit humidity\n• graphic display remotable up to 50 m without external power supply (200 m with external power supply) to show demand, ambient probe reading, limit probe reading, steam production, alarms, system parameters\n• keyboard to change the displayed value, edit the system parameters, reset the alarms\n• maximum production can be manually set from 25% to 100% of the rated production (from 12.5% for model 180 kg/h)\n• patented antifoam algorithm (AFS) to prevent irregular operation due to the formation of foam inside the cylinder\n• daily and weekly on/off timers\n• up to 4 different daily automatic set points shall be editable\n• display of the supply water conductivity\n• selection of the language\n• selection of the units of measure (SI or Imperial)\n• the alarm relay logic shall be selectable (NO or NC)\n• alarm history (200 alarms)\n• the humidifier shall also be enabled/disabled from the keyboard\n• automatic check of valves, pump, water level sensor, presence of supply water at the start-up\n• automatic initial self-test\n• automatic management of the lack of supply water with automatic restart when the water is available again\n• pre-heating to keep the water warm in order to reduce the time to production (user-editable)\n• automatic anti-freezing cycle to protect the boiler’s water\n• the boiler(s) shall be automatically emptied in case of prolonged inactivity, with the inactivity time-out user-editable\n• estimation of the lime scale build-up through the fumes temperature probe (NTC) and automatic maintenance warning\n• start/stop of an external de-humidifier according to a user-editable %rH set point\n• it shall be possible to force each digital output for servicing\n• model 180 kg/h with 2 burners: selection between sequence and parallel duty of the burners\n• model 180 kg/h with 2 burners: burner rotation user selectable based on the running time difference (the rotation can be disabled, set to occur at the\nignition or during the production)\n• optional: communication via LON®, BACnet™ over Ethernet, BACnet™ over IP, BACnet™ over MS/TP, TCP/IP, SNMP, DHCP, HTTP, FTP\n• optional: remote diagnostic via GSM\n• optional: wall-mounting %rH probe for civil environment (10 %rH … 90 %rH)\n• optional: %rH & temperature industrial probe min. IP54 (0 %rH … 100 %rH, - 10T70 °C)\n• optional: %rH probe for duct min. IP40 (10 %rH … 90 %rH)\n• optional: %rH limit probe for duct min. IP40 (0 %rH … 100 %rH)\n• optional: temperature probe min. IP55 (-30T90 °C)\nMain technical specs:\nRated steam production …………….………kg/h\nHeat power input ………………………………..kW\nGas G20/G25/G31\nNOX class 5 (UG045, UG090) / 4 (UG180)\nPower supply 230 VAC 1-fase, max 300 W\nNo. of steam outlets …………………….\nSteam outlet diameter 40 mm\nSteam pressure 2000 Pa\nSupply water connection 3/4” G MALE\nDrain connection …………….……………..……40 mm\nAccessories for duct installations:\nSteam lance made of AISI304 with fitting flange and condensate outlet; length…….mm"]
{"$rows_empty":8}
[null,{"$f":"MID(DESIGN!F110,1,2)","v":"UR"}]
[null,{"$f":"DESIGN!E26","v":"ENGLISH"}]

{"sheet":"Steam absoprtion distance ","index":8,"n_rows":51,"n_cols":33,"rows_kept":51,"merged":[[5,1,5,3],[5,6,5,8],[5,11,5,13],[14,6,14,8]]}
[]
[{"$nulls":4},{"$f":"LINGUA!B3","v":"INSTRUCTIONS: insert input data in grey cells. Results appear in green cells."}]
[]
[{"$nulls":29},"ca",1.006,"kJ/kg*°K"]
[]
[null,"Input",{"$nulls":4},{"$f":"LINGUA!B6","v":"External Air"},{"$nulls":4},"Output"]
[]
[null,null,{"$f":"LINGUA!B45","v":"Steam distributor"},{"$nulls":4},{"$f":"LINGUA!B10","v":"Temperature"},{"$nulls":4},{"$f":"LINGUA!B59","v":"Max kg/h per distributor"}]
[null,null,"DP085D40R0",{"$nulls":4},{"$f":"DESIGN!E37","v":-5},{"$nulls":4},{"$f":"LOOKUP(AF36,AB15:AB35,AE15:AE35)","v":25}]
[]
[null,null,{"$f":"LINGUA!B57","v":"No. of distributors in the duct"},{"$nulls":4},{"$f":"LINGUA!B9","v":"Relative humidity"},{"$nulls":4},{"$f":"LINGUA!B60","v":"Distributor length (mm)"}]
[null,null,2,{"$nulls":4},{"$f":"DESIGN!E36","v":{"v":0.9,"d":"90%"}},{"$nulls":4},{"$f":"LOOKUP(AF36,AB15:AB35,AD15:AD35)","v":834}]
[]
[null,null,{"$f":"LINGUA!B58","v":"Humidifier capacity (kg/h)"},{"$nulls":9},{"$f":"LINGUA!B20","v":"Air speed"},{"$nulls":14},"#","code","L mm","Max kg/h"]
[null,null,{"v":40,"d":"40.00"},{"$nulls":3},{"$f":"LINGUA!B14","v":"Duct"},{"$nulls":5},{"$f":"AG47","v":{"v":2.1043771043771042,"d":"2.10"}},{"$nulls":14},1,"DP030D22RU",300,4,{"$f":"IF(AC15=$C$9,1,0)*AB15","v":0}]
[{"$nulls":27},{"$f":"AB15+1","v":2},"DP035D22R0",332,4,0]
[{"$nulls":7},{"$f":"LINGUA!B18","v":"Air flow V"},{"$nulls":4},{"$f":"LINGUA!B61","v":"Humidification distance (m)"},{"$nulls":14},3,"DP045D22R0",438,6,0]
[{"$nulls":7},{"$f":"DESIGN!E77","v":{"v":10000,"d":"10,000"}},{"$nulls":4},{"$f":"ROUNDUP(IF(AND(G28=\"\",G29=\"\"),0.05+IF((3.26/(LN(0.119*AE51*((C15/(C12*(M12/1000)))^(0.26))*(AG47^(0.086))))^2)<0,0,(3.26/(LN(0.119*AE51*((C15/(C12*(M12/1000)))^(0.26))*(AG47^(0.086))))^2)),\"\")*1.1,2)","v":0.61},null,null,"=",{"$nulls":11},4,"DP060D22R0",597,9,0]
[{"$nulls":27},5,"DP085D22R0",835,9,0]
[{"$nulls":7},{"$f":"LINGUA!B16","v":"Internal height C2"},{"$nulls":19},6,"DP030D30RU",300,15,0]
[{"$nulls":7},{"$f":"DESIGN!E76","v":1100},{"$nulls":19},7,"DP035D30R0",343,5,0]
[{"$nulls":27},8,"DP045D30R0",427,8,0]
[{"$nulls":7},{"$f":"LINGUA!B15","v":"Internal width C1"},{"$nulls":19},9,"DP045D30RU",450,15,0]
[{"$nulls":7},{"$f":"DESIGN!E75","v":1200},{"$nulls":19},10,"DP060D30R0",596,12,0]
[{"$nulls":11},{"$f":"LINGUA!B62","v":"The humidification distance is calculated using the work of Gundacker "},{"$nulls":15},11,"DP060D30RU",600,15,0]
[{"$nulls":27},12,"DP085D30R0",850,18,0]
[{"$nulls":27},13,"DP105D30R0",1048,18,0]
[{"$nulls":3},{"$f":"IF(OR(G28<>\"\",G29<>\"\",G30<>\"\",),\"ERROR\", \"\")","v":""},null,null,{"$f":"IF(M12>H24,LINGUA!B63,\"\")","v":""},{"$nulls":20},14,"DP125D30R0",1245,18,0]
[{"$nulls":6},{"$f":"IF((M9*C12)<C15,LINGUA!B64,\"\")","v":""},{"$nulls":20},15,"DP165D30R0",1640,18,0]
[{"$nulls":6},{"$f":"IF(C15/H18/1.2*1000+DESIGN!J36>AE50*1000,LINGUA!B519,\"\")","v":""},{"$nulls":20},16,"DP060D40RU",600,45,0]
[{"$nulls":27},17,"DP085D40R0",834,25,17]
[{"$nulls":27},18,"DP105D40R0",1015,35,0]
[{"$nulls":27},19,"DP125D40R0",1222,45,0]
[{"$nulls":27},20,"DP165D40R0",1636,45,0]
[{"$nulls":27},21,"DP205D40R0",2025,45,0]
[{"$nulls":31},{"$f":"SUM(AF15:AF35)","v":17}]
[]
[]
[{"$nulls":27},"a",-5674.359,-5800.2206,"c.s. aria J/(°C*g)=",1.006]
[{"$nulls":27},"b",6.3925247,1.3914993,"c.s. vapo J/(°C*g)=",1.805]
[{"$nulls":27},"c",-0.009677843,-0.048640239,"c latente J/g=",2501]
[{"$nulls":27},"d",{"v":6.2215701e-07,"d":"6.22E-07"},{"v":4.1764768e-05,"d":"4.18E-05"},"R Joule/Kmole*°K=",8313.6]
[{"$nulls":27},"e",{"v":2.0747825e-09,"d":"2.07E-09"},{"v":-1.4452093e-08,"d":"-1.45E-08"},"coefficiente fs",1.004]
[{"$nulls":27},"f",{"v":-9.484024e-13,"d":"-9.48E-13"},0,"coefficiente psi",0.62198]
[{"$nulls":27},"g",4.1635019,6.5459673]
[{"$nulls":27},"t in",{"$f":"H9","v":-5},"t fin",{"$f":"DESIGN!E42","v":20},"density",{"$f":"1.293*(AC50/101325)*(273.15/DESIGN!AF43)*(1/(1+1.6078*DESIGN!AF45/1000))","v":1.2045707891199364}]
[{"$nulls":27},"% in",{"$f":"H12","v":{"v":0.9,"d":"90%"}},null,null,"Air velocity m/sec",{"$f":"DESIGN!E79","v":{"v":2.1043771043771042,"d":"2.10"}}]
[{"$nulls":27},"T in",{"$f":"AC46+273.15","v":268.15},"T fin",{"$f":"AE46+273.15","v":293.15},"d x",{"$f":"AG49-AC51*1000","v":3.3333012521264864}]
[{"$nulls":27},"Psat in",{"$f":"IF(AC46<0,EXP($AC$39/AC48+$AC$40+$AC$41*AC48+$AC$42*AC48^2+$AC$43*AC48^3+$AC$44*AC48^4+$AC$45*LN(AC48)),EXP($AD$39/AC48+$AD$40+$AD$41*AC48+$AD$42*AC48^2+$AD$43*AC48^3+$AD$44*AC48^4+$AD$45*LN(AC48)))","v":402.02925588076624},"Psat fin",{"$f":"IF(AE46<0,EXP($AC$39/AE48+$AC$40+$AC$41*AE48+$AC$42*AE48^2+$AC$43*AE48^3+$AC$44*AE48^4+$AC$45*LN(AE48)),EXP($AD$39/AE48+$AD$40+$AD$41*AE48+$AD$42*AE48^2+$AD$43*AE48^3+$AD$44*AE48^4+$AD$45*LN(AE48)))","v":2338.8037000739814},"x finale",{"$f":"IF(C15/H18/1.2*1000+DESIGN!J36<=AE50*1000,C15/H18/1.2*1000+DESIGN!J36,AE50*1000)","v":5.571267499490611}]
[{"$nulls":27},"P atm",{"$f":"DESIGN!W42","v":101325},"x sat",{"$f":"0.62198*1.004*AE49/(AC50-1.004*AE49)","v":0.014756056728637994},"t finale",{"$f":"DESIGN!Z43-273.15","v":{"v":20,"d":"20.0"}}]
[{"$nulls":27},"umi spec in kg/kg",{"$f":"$AF$43*$AF$44*AC47*AC49/(AC50-$AF$43*AC47*AC49)","v":0.002237966247364125},"eff sat",{"$f":"AG48/(1000*(AE50-AC51))","v":0.2662787313378871}]

{"sheet":"Currencies","index":9,"n_rows":3,"n_cols":2,"rows_kept":3,"hidden":true}
["Eur"]
["GBP",0.73]
["CNY",6.95]

{"sheet":"Potenze","index":10,"n_rows":287,"n_cols":22,"rows_kept":287,"hidden":true,"merged":[[0,0,0,2]]}
["Potenze UR",{"$nulls":4},"UG"]
["UR002HD003",{"$f":"MID(A2,7,1)","v":"D"},{"$f":"IF(B2=$K$5,$L$5,$L$4)","v":{"v":2,"d":"2.0"}},null,{"$f":"VLOOKUP(SELECTION!B7,Potenze!A:C,3,0)","v":60},{"$f":"IF(E1<>F1,CONCATENATE(\" -\",E2,\" kW -\"), \"\")","v":" -60 kW -"}]
["UR004HD003",{"$f":"MID(A3,7,1)","v":"D"},3.3,{"$nulls":8},2,4,6,10,13,20,27,40,53,60,80]
["UR006HD003","D",4.7,{"$nulls":7},"U",{"v":2,"d":"2.00"},{"v":3.6,"d":"3.60"},{"v":4.8,"d":"4.80"}]
["UR006HK003","K",4.7,{"$nulls":7},"D",{"v":2,"d":"2.00"},{"v":3.3,"d":"3.30"},{"v":4.7,"d":"4.70"}]
["UR010HK003","K",7.4,{"$nulls":7},"W",null,null,{"v":4.8,"d":"4.80"},{"v":8.1,"d":"8.10"},null,{"v":16.2,"d":"16.20"}]
["UR013HK003","K",9.9,{"$nulls":7},"K",null,null,{"v":4.7,"d":"4.70"},{"v":7.4,"d":"7.40"},{"v":9.9,"d":"9.90"},{"v":15.1,"d":"15.10"},{"v":19.8,"d":"19.80"}]
["UR020HK003","K",15.1,{"$nulls":7},"L",null,null,{"v":4.7,"d":"4.70"},{"v":7.4,"d":"7.40"},{"v":10,"d":"10.00"},{"v":15.2,"d":"15.20"},{"v":20,"d":"20.00"},{"v":30.5,"d":"30.50"},{"v":40,"d":"40.00"},{"v":45.7,"d":"45.70"},{"v":60,"d":"60.00"}]
["UR027HK003","K",19.8,{"$nulls":7},"M",{"$nulls":3},{"v":7.8,"d":"7.80"},{"v":9.8,"d":"9.80"},{"v":15.1,"d":"15.10"},{"v":20.2,"d":"20.20"},{"v":30.1,"d":"30.10"},{"v":40.3,"d":"40.30"},{"v":45.2,"d":"45.20"},{"v":60.5,"d":"60.50"}]
["UR006HL003","L",{"v":4.7,"d":"4.70"},{"$nulls":7},"N",{"$nulls":4},{"v":9.7,"d":"9.70"},{"v":15,"d":"15.00"},{"v":19.8,"d":"19.80"},{"v":30,"d":"30.00"},{"v":39.6,"d":"39.60"},{"v":45.1,"d":"45.10"},{"v":59.4,"d":"59.40"}]
["UR010HL003","L",{"v":7.4,"d":"7.40"}]
["UR013HL003","L",{"v":10,"d":"10.00"}]
["UR020HL003","L",{"v":15.2,"d":"15.20"}]
["UR027HL003","L",{"v":20,"d":"20.00"}]
["UR040HL003","L",{"v":30.5,"d":"30.50"}]
["UR053HL003","L",{"v":40,"d":"40.00"}]
["UR060HL003","L",{"v":45.7,"d":"45.70"}]
["UR080HL003","L",{"v":60,"d":"60.00"}]
["UR010HM003","M",{"v":7.8,"d":"7.80"}]
["UR013HM003","M",{"v":9.8,"d":"9.80"}]
["UR020HM003","M",{"v":15.1,"d":"15.10"}]
["UR027HM003","M",{"v":20.2,"d":"20.20"}]
["UR040HM003","M",{"v":30.1,"d":"30.10"}]
["UR053HM003","M",{"v":40.3,"d":"40.30"}]
["UR060HM003","M",{"v":45.2,"d":"45.20"}]
["UR080HM003","M",{"v":60.5,"d":"60.50"}]
["UR002HD103","D",{"v":2,"d":"2.0"}]
["UR004HD103","D",3.3]
["UR006HD103","D",4.7]
["UR006HK103","K",4.7]
["UR010HK103","K",7.4]
["UR013HK103","K",9.9]
["UR020HK103","K",15.1]
["UR027HK103","K",19.8]
["UR006HL103","L",4.7]
["UR010HL103","L",7.4]
["UR013HL103","L",{"v":10,"d":"10.0"}]
["UR020HL103","L",15.2]
["UR027HL103","L",{"v":20,"d":"20.0"}]
["UR040HL103","L",30.5]
["UR053HL103","L",{"v":40,"d":"40.0"}]
["UR060HL103","L",45.7]
["UR080HL103","L",{"v":60,"d":"60.0"}]
["UR010HM103","M",7.8]
["UR013HM103","M",9.8]
["UR020HM103","M",15.1]
["UR027HM103","M",20.2]
["UR040HM103","M",30.1]
["UR053HM103","M",40.3]
["UR060HM103","M",45.2]
["UR080HM103","M",60.5]
[]
["UE001YD001",{"$f":"MID(A53,1,5)","v":"UE001"},{"$f":"VLOOKUP(B53,$I$53:$J$66,2,0)","v":1.1},{"$nulls":5},"UE001",1.1]
["UE001YDC01","UE001",{"$f":"VLOOKUP(B54,$I$53:$J$66,2,0)","v":1.1},{"$nulls":5},"UE003",2.2]
["UE001YU001","UE001",1.1,{"$nulls":5},"UE005",3.7]
["UE001YUC01","UE001",1.1,{"$nulls":5},"UE008",6]
["UE003YD001","UE003",2.2,{"$nulls":5},"UE009",6.7]
["UE003YDC01","UE003",2.2,{"$nulls":5},"UE010",7.5]
["UE003YK001","UE003",2.2,{"$nulls":5},"UE015",11.2]
["UE003YKC01","UE003",2.2,{"$nulls":5},"UE018",13.5]
["UE003YL001","UE003",2.2,{"$nulls":5},"UE025",18.7]
["UE003YLC01","UE003",2.2,{"$nulls":5},"UE035",26.2]
["UE003YM001","UE003",2.2,{"$nulls":5},"UE045",33.7]
["UE003YMC01","UE003",2.2,{"$nulls":5},"UE065",48.7]
[null,"",{"$error":"#N/A"},{"$nulls":5},"UE090",67.5]
[null,"",{"$error":"#N/A"},{"$nulls":5},"UE130",97.5]
["UE003YU001","UE003",2.2]
["UE003YUC01","UE003",2.2]
["UE003YW001","UE003",2.2]
["UE003YWC01","UE003",2.2]
["UE005YD001","UE005",3.7]
["UE005YDC01","UE005",3.7]
["UE005YK001","UE005",3.7]
["UE005YKC01","UE005",3.7]
["UE005YL001","UE005",3.7]
["UE005YLC01","UE005",3.7]
["UE005YM001","UE005",3.7]
["UE005YMC01","UE005",3.7]
["UE005YN001","UE005",3.7]
["UE005YNC01","UE005",3.7]
["UE005YU001","UE005",3.7]
["UE005YUC01","UE005",3.7]
["UE005YW001","UE005",3.7]
["UE005YWC01","UE005",3.7]
["UE008YK001",{"$f":"MID(A85,1,5)","v":"UE008"},{"v":6,"d":"6.0"}]
["UE008YKC01","UE008",{"v":6,"d":"6.0"}]
["UE008YL001","UE008",{"v":6,"d":"6.0"}]
["UE008YLC01","UE008",{"v":6,"d":"6.0"}]
["UE008YM001","UE008",{"v":6,"d":"6.0"}]
["UE008YMC01","UE008",{"v":6,"d":"6.0"}]
["UE008YN001","UE008",{"v":6,"d":"6.0"}]
["UE008YNC01","UE008",{"v":6,"d":"6.0"}]
["UE008YW001","UE008",{"v":6,"d":"6.0"}]
["UE008YWC01","UE008",{"$f":"VLOOKUP(B94,$I$53:$J$66,2,0)","v":{"v":6,"d":"6.0"}}]
["UE009YD001","UE009",6.7]
["UE009YDC01","UE009",6.7]
["UE009YU001","UE009",6.7]
["UE009YUC01","UE009",6.7]
["UE010YK001","UE010",7.5]
["UE010YKC01","UE010",7.5]
["UE010YL001","UE010",7.5]
["UE010YLC01","UE010",7.5]
["UE010YM001","UE010",7.5]
["UE010YMC01","UE010",7.5]
["UE010YN001","UE010",7.5]
["UE010YNC01","UE010",7.5]
["UE010YW001","UE010",7.5]
["UE010YWC01","UE010",{"$f":"VLOOKUP(B108,$I$53:$J$66,2,0)","v":7.5}]
["UE015YK001","UE015",11.2]
["UE015YKC01","UE015",11.2]
["UE015YL001","UE015",11.2]
["UE015YLC01","UE015",11.2]
["UE015YM001","UE015",11.2]
["UE015YMC01","UE015",11.2]
["UE015YN001","UE015",11.2]
["UE015YNC01","UE015",11.2]
["UE015YW001",{"$f":"MID(A117,1,5)","v":"UE015"},11.2]
["UE015YWC01","UE015",{"$f":"VLOOKUP(B118,$I$53:$J$66,2,0)","v":11.2}]
["UE018YL001","UE018",13.5]
["UE018YLC01","UE018",13.5]
["UE018YM001","UE018",13.5]
["UE018YMC01","UE018",13.5]
["UE018YN001","UE018",13.5]
["UE018YNC01","UE018",13.5]
["UE025YK001","UE025",18.7]
["UE025YKC01","UE025",18.7]
["UE025YL001","UE025",18.7]
["UE025YLC01","UE025",18.7]
["UE025YM001","UE025",18.7]
["UE025YMC01","UE025",18.7]
["UE025YN001","UE025",18.7]
["UE025YNC01","UE025",18.7]
["UE025YW001","UE025",18.7]
["UE025YWC01","UE025",18.7]
["UE035YK001","UE035",{"$f":"VLOOKUP(B135,$I$53:$J$66,2,0)","v":26.2}]
["UE035YKC01","UE035",{"$f":"VLOOKUP(B136,$I$53:$J$66,2,0)","v":26.2}]
["UE035YL001","UE035",26.2]
["UE035YLC01","UE035",26.2]
["UE035YM001","UE035",26.2]
["UE035YMC01","UE035",26.2]
["UE035YN001","UE035",26.2]
["UE035YNC01","UE035",26.2]
["UE035YW001","UE035",26.2]
["UE035YWC01","UE035",26.2]
["UE045YK001","UE045",33.7]
["UE045YKC01","UE045",33.7]
["UE045YL001","UE045",33.7]
["UE045YLC01","UE045",33.7]
["UE045YM001",{"$f":"MID(A149,1,5)","v":"UE045"},33.7]
["UE045YMC01","UE045",33.7]
["UE045YN001","UE045",{"$f":"VLOOKUP(B151,$I$53:$J$66,2,0)","v":33.7}]
["UE045YNC01","UE045",{"$f":"VLOOKUP(B152,$I$53:$J$66,2,0)","v":33.7}]
["UE045YW001","UE045",33.7]
["UE045YWC01","UE045",33.7]
["UE065YL001","UE065",48.7]
["UE065YLC01","UE065",48.7]
["UE065YM001","UE065",48.7]
["UE065YMC01","UE065",48.7]
["UE065YN001","UE065",48.7]
["UE065YNC01","UE065",48.7]
["UE001XD001","UE001",1.1]
["UE001XDC01","UE001",1.1]
["UE001XU001","UE001",1.1]
["UE001XUC01","UE001",1.1]
["UE003XD001","UE003",2.2]
["UE003XDC01","UE003",2.2]
["UE003XK001","UE003",2.2]
["UE003XKC01","UE003",2.2]
["UE003XL001","UE003",{"$f":"VLOOKUP(B169,$I$53:$J$66,2,0)","v":2.2}]
["UE003XLC01","UE003",{"$f":"VLOOKUP(B170,$I$53:$J$66,2,0)","v":2.2}]
["UE003XM001","UE003",2.2]
["UE003XMC01","UE003",2.2]
[null,"",{"$error":"#N/A"}]
[null,"",{"$error":"#N/A"}]
["UE003XU001","UE003",2.2]
["UE003XUC01","UE003",2.2]
["UE003XW001","UE003",2.2]
["UE003XWC01","UE003",2.2]
["UE005XD001","UE005",3.7]
["UE005XDC01","UE005",3.7]
["UE005XK001",{"$f":"MID(A181,1,5)","v":"UE005"},3.7]
["UE005XKC01","UE005",3.7]
["UE005XL001","UE005",3.7]
["UE005XLC01","UE005",3.7]
["UE005XM001","UE005",3.7]
["UE005XMC01","UE005",3.7]
["UE005XN001","UE005",3.7]
["UE005XNC01","UE005",{"$f":"VLOOKUP(B188,$I$53:$J$66,2,0)","v":3.7}]
["UE005XU001","UE005",{"$f":"VLOOKUP(B189,$I$53:$J$66,2,0)","v":3.7}]
["UE005XUC01","UE005",3.7]
["UE005XW001","UE005",3.7]
["UE005XWC01","UE005",3.7]
["UE008XK001","UE008",{"v":6,"d":"6.0"}]
["UE008XKC01","UE008",{"v":6,"d":"6.0"}]
["UE008XL001","UE008",{"v":6,"d":"6.0"}]
["UE008XLC01","UE008",{"v":6,"d":"6.0"}]
["UE008XM001","UE008",{"v":6,"d":"6.0"}]
["UE008XMC01","UE008",{"v":6,"d":"6.0"}]
["UE008XN001","UE008",{"v":6,"d":"6.0"}]
["UE008XNC01","UE008",{"v":6,"d":"6.0"}]
["UE008XW001","UE008",{"v":6,"d":"6.0"}]
["UE008XWC01","UE008",{"v":6,"d":"6.0"}]
["UE009XD001","UE009",6.7]
["UE009XDC01","UE009",6.7]
["UE009XU001","UE009",6.7]
["UE009XUC01","UE009",6.7]
["UE010XK001","UE010",7.5]
["UE010XKC01","UE010",7.5]
["UE010XL001","UE010",7.5]
["UE010XLC01","UE010",7.5]
["UE010XM001","UE010",7.5]
["UE010XMC01","UE010",7.5]
["UE010XN001",{"$f":"MID(A213,1,5)","v":"UE010"},7.5]
["UE010XNC01","UE010",7.5]
["UE010XW001","UE010",{"$f":"VLOOKUP(B215,$I$53:$J$66,2,0)","v":7.5}]
["UE010XWC01","UE010",{"$f":"VLOOKUP(B216,$I$53:$J$66,2,0)","v":7.5}]
["UE015XK001","UE015",11.2]
["UE015XKC01","UE015",11.2]
["UE015XL001","UE015",11.2]
["UE015XLC01","UE015",11.2]
["UE015XM001","UE015",11.2]
["UE015XMC01","UE015",11.2]
["UE015XN001","UE015",11.2]
["UE015XNC01","UE015",11.2]
["UE015XW001","UE015",11.2]
["UE015XWC01","UE015",11.2]
["UE018XL001","UE018",13.5]
["UE018XLC01","UE018",13.5]
["UE018XM001","UE018",13.5]
["UE018XMC01","UE018",13.5]
["UE018XN001","UE018",13.5]
["UE018XNC01","UE018",13.5]
["UE025XK001","UE025",18.7]
["UE025XKC01","UE025",18.7]
["UE025XL001","UE025",18.7]
["UE025XLC01","UE025",18.7]
["UE025XM001","UE025",18.7]
["UE025XMC01","UE025",18.7]
["UE025XN001","UE025",18.7]
["UE025XNC01","UE025",18.7]
["UE025XW001","UE025",18.7]
["UE025XWC01","UE025",18.7]
["UE035XK001","UE035",26.2]
["UE035XKC01","UE035",26.2]
["UE035XL001",{"$f":"MID(A245,1,5)","v":"UE035"},26.2]
["UE035XLC01",{"$f":"MID(A246,1,5)","v":"UE035"},26.2]
["UE035XM001","UE035",26.2]
["UE035XMC01","UE035",26.2]
["UE035XN001","UE035",26.2]
["UE035XNC01","UE035",26.2]
["UE035XW001","UE035",26.2]
["UE035XWC01","UE035",26.2]
["UE045XK001","UE045",33.7]
["UE045XKC01","UE045",33.7]
["UE045XL001","UE045",33.7]
["UE045XLC01","UE045",{"$f":"VLOOKUP(B256,$I$53:$J$66,2,0)","v":33.7}]
["UE045XM001","UE045",33.7]
["UE045XMC01","UE045",33.7]
["UE045XN001","UE045",33.7]
["UE045XNC01","UE045",33.7]
["UE045XW001","UE045",33.7]
["UE045XWC01","UE045",33.7]
["UE065XL001","UE065",48.7]
["UE065XLC01","UE065",48.7]
["UE065XM001","UE065",48.7]
["UE065XMC01","UE065",48.7]
["UE065XN001","UE065",48.7]
["UE065XNC01","UE065",48.7]
["UE090XL001","UE090",67.5]
["UE090XLC01","UE090",{"$f":"VLOOKUP(B270,$I$53:$J$66,2,0)","v":67.5}]
["UE090XM001","UE090",67.5]
["UE090XMC01","UE090",67.5]
["UE090XN001","UE090",67.5]
["UE090XNC01","UE090",67.5]
["UE130XL001","UE130",97.5]
["UE130XLC01","UE130",97.5]
["UE130XM001","UE130",97.5]
["UE130XMC01","UE130",97.5]
["UE130XN001","UE130",97.5]
["UE130XNC01","UE130",{"$f":"VLOOKUP(B280,$I$53:$J$66,2,0)","v":97.5}]
[]
["UG045HD003",null,{"v":0.11,"d":"0.1"}]
["UG090HD003",null,{"v":0.14,"d":"0.1"}]
["UG180HD003",null,{"v":0.19,"d":"0.2"}]
["UG045HD103",null,{"v":0.11,"d":"0.1"}]
["UG090HD103",null,{"v":0.14,"d":"0.1"}]
["UG180HD103",null,{"v":0.19,"d":"0.2"}]

{"sheet":"Commissioning","index":11,"n_rows":36,"n_cols":17,"rows_kept":36,"hidden":true,"merged":[[1,0,2,0],[1,2,1,3],[1,6,11,6],[1,14,2,14],[1,15,2,15],[1,16,2,16],[12,6,22,6],[26,6,28,6],[29,6,31,6]]}
[{"$nulls":7},"Cod. Humid",null,"Cod. WTS","Descrizione WTS","Cod. vaso","Descizione Vaso"]
[null,null,"AVVIAMENTO",{"$nulls":3},"50 Hz","UR002","25 l/h","ROC0605000",{"$f":"VLOOKUP(J2,LINGUA!$B$523:$C$532,2,0)","v":"Reverse osmosis system 60 l / h - 230V 50Hz - for steel"},"ROKC00KTVE",{"$f":"VLOOKUP(L2,LINGUA!$B$523:$C$542,2,0)","v":"Kit expansion vessel with hoses and fittings"},null,"UG","Osmosi [codice] [l/h]","Vaso d’espansione [codice] [l/h]"]
[null,null,"Prima/prime due macchine","Extra macchina successiva",{"$f":"LINGUA!C765","v":"Tecnical and practical support"},null,null,"UR004","25 l/h","ROC0605000",{"$f":"VLOOKUP(J3,LINGUA!$B$523:$C$532,2,0)","v":"Reverse osmosis system 60 l / h - 230V 50Hz - for steel"},"ROKC00KTVE",{"$f":"VLOOKUP(L3,LINGUA!$B$523:$C$542,2,0)","v":"Kit expansion vessel with hoses and fittings"}]
["UE","HMCOMMKF0",200,50,250,null,null,"UR006","25 l/h","ROC0605000",{"$f":"VLOOKUP(J4,LINGUA!$B$523:$C$532,2,0)","v":"Reverse osmosis system 60 l / h - 230V 50Hz - for steel"},"ROKC00KTVE",{"$f":"VLOOKUP(L4,LINGUA!$B$523:$C$542,2,0)","v":"Kit expansion vessel with hoses and fittings"},null,"UG045HD002","ROL100***   160 l/h","AUC2000000    200 l/h"]
["UR","HMCOMMKF0",200,50,250,null,null,"UR010","25 l/h","ROC0605000",{"$f":"VLOOKUP(J5,LINGUA!$B$523:$C$532,2,0)","v":"Reverse osmosis system 60 l / h - 230V 50Hz - for steel"},"ROKC00KTVE",{"$f":"VLOOKUP(L5,LINGUA!$B$523:$C$542,2,0)","v":"Kit expansion vessel with hoses and fittings"},null,"UG090HD002","ROL100***   160 l/h","AUC2000000    200 l/h"]
["UG","HMCOMMKF0",400,100,450,null,null,"UR013","25 l/h","ROC0605000",{"$f":"VLOOKUP(J6,LINGUA!$B$523:$C$532,2,0)","v":"Reverse osmosis system 60 l / h - 230V 50Hz - for steel"},"ROKC00KTVE",{"$f":"VLOOKUP(L6,LINGUA!$B$523:$C$542,2,0)","v":"Kit expansion vessel with hoses and fittings"},null,"UG0180HD002","ROL320***   320 l/h","AUC2000000    200 l/h"]
[{"$nulls":7},"UR020","80 l/h","ROC0605000",{"$f":"VLOOKUP(J7,LINGUA!$B$523:$C$532,2,0)","v":"Reverse osmosis system 60 l / h - 230V 50Hz - for steel"},"AUC2000000",{"$f":"VLOOKUP(L7,LINGUA!$B$523:$C$542,2,0)","v":"AUTOCLAVE 200 Liters (expansion vessel)"}]
["WTS","HMCOMMKF0",350,250,{"$nulls":3},"UR027","80 l/h","ROC0605000",{"$f":"VLOOKUP(J8,LINGUA!$B$523:$C$532,2,0)","v":"Reverse osmosis system 60 l / h - 230V 50Hz - for steel"},"AUC2000000",{"$f":"VLOOKUP(L8,LINGUA!$B$523:$C$542,2,0)","v":"AUTOCLAVE 200 Liters (expansion vessel)"},null,"UR","Osmosi [codice] [l/h]","Vaso d’espansione [codice] [l/h]"]
[{"$nulls":7},"UR040","80 l/h","ROC0605000",{"$f":"VLOOKUP(J9,LINGUA!$B$523:$C$532,2,0)","v":"Reverse osmosis system 60 l / h - 230V 50Hz - for steel"},"AUC2000000",{"$f":"VLOOKUP(L9,LINGUA!$B$523:$C$542,2,0)","v":"AUTOCLAVE 200 Liters (expansion vessel)"},null,"UR002***01","ROC0255000 ","ROKC00KTVE    15 l/h"]
[null,null,250,450,{"$nulls":3},"UR053","80 l/h","ROC0605000",{"$f":"VLOOKUP(J10,LINGUA!$B$523:$C$532,2,0)","v":"Reverse osmosis system 60 l / h - 230V 50Hz - for steel"},"AUC3000000",{"$f":"VLOOKUP(L10,LINGUA!$B$523:$C$542,2,0)","v":"AUTOCLAVE 300 Liters (expansion vessel)"},null,"UR004***01","ROC0255000","ROKC00KTVE    15 l/h"]
[{"$nulls":7},"UR060","80 l/h","ROC0605000",{"$f":"VLOOKUP(J11,LINGUA!$B$523:$C$532,2,0)","v":"Reverse osmosis system 60 l / h - 230V 50Hz - for steel"},"AUC3000000",{"$f":"VLOOKUP(L11,LINGUA!$B$523:$C$542,2,0)","v":"AUTOCLAVE 300 Liters (expansion vessel)"},null,"UR006***01","ROC0255000","ROKC00KTVE    15 l/h"]
[null,null,{"$f":"LINGUA!C760","v":"Training- 2 h at yard"},{"$nulls":4},"UR080","100 l/h","ROL1005U00",{"$f":"VLOOKUP(J12,LINGUA!$B$523:$C$532,2,0)","v":"Reverse osmosis system 100 l / h - 230V 50Hz - for steel"},"AUC3000000",{"$f":"VLOOKUP(L12,LINGUA!$B$523:$C$542,2,0)","v":"AUTOCLAVE 300 Liters (expansion vessel)"},null,"UR010***01","ROC0255000","ROKC00KTVE    15 l/h"]
[null,null,125,{"$nulls":3},"60 Hz","UR002","25 l/h","ROC0606000",{"$f":"VLOOKUP(J13,LINGUA!$B$523:$C$532,2,0)","v":"Reverse osmosis system 60 l / h - 230V 60Hz - for steel"},"ROKC00KTVE",{"$f":"VLOOKUP(L13,LINGUA!$B$523:$C$542,2,0)","v":"Kit expansion vessel with hoses and fittings"},null,"UR020***01","ROL060***…85 l/h","AUC1000000    100 l/h"]
[{"$nulls":7},"UR004","25 l/h","ROC0606000",{"$f":"VLOOKUP(J14,LINGUA!$B$523:$C$532,2,0)","v":"Reverse osmosis system 60 l / h - 230V 60Hz - for steel"},"ROKC00KTVE",{"$f":"VLOOKUP(L14,LINGUA!$B$523:$C$542,2,0)","v":"Kit expansion vessel with hoses and fittings"},null,"UR027***01","ROL060***…85 l/h","AUC2000000    200 l/h"]
[{"$nulls":7},"UR006","25 l/h","ROC0606000",{"$f":"VLOOKUP(J15,LINGUA!$B$523:$C$532,2,0)","v":"Reverse osmosis system 60 l / h - 230V 60Hz - for steel"},"ROKC00KTVE",{"$f":"VLOOKUP(L15,LINGUA!$B$523:$C$542,2,0)","v":"Kit expansion vessel with hoses and fittings"},null,"UR040***01","ROL060***…85 l/h","AUC2000000    200 l/h"]
[{"$nulls":7},"UR010","25 l/h","ROC0606000",{"$f":"VLOOKUP(J16,LINGUA!$B$523:$C$532,2,0)","v":"Reverse osmosis system 60 l / h - 230V 60Hz - for steel"},"ROKC00KTVE",{"$f":"VLOOKUP(L16,LINGUA!$B$523:$C$542,2,0)","v":"Kit expansion vessel with hoses and fittings"},null,"UR060***01","ROL060***…85 l/h","AUC3000000    300 l/h"]
[{"$nulls":7},"UR013","25 l/h","ROC0606000",{"$f":"VLOOKUP(J17,LINGUA!$B$523:$C$532,2,0)","v":"Reverse osmosis system 60 l / h - 230V 60Hz - for steel"},"ROKC00KTVE",{"$f":"VLOOKUP(L17,LINGUA!$B$523:$C$542,2,0)","v":"Kit expansion vessel with hoses and fittings"},null,"UR060***01","ROL060***…85 l/h","AUC3000000    300 l/h"]
[{"$nulls":7},"UR020","80 l/h","ROC0606000",{"$f":"VLOOKUP(J18,LINGUA!$B$523:$C$532,2,0)","v":"Reverse osmosis system 60 l / h - 230V 60Hz - for steel"},"AUC2000000",{"$f":"VLOOKUP(L18,LINGUA!$B$523:$C$542,2,0)","v":"AUTOCLAVE 200 Liters (expansion vessel)"}]
[{"$nulls":7},"UR027","80 l/h","ROC0606000",{"$f":"VLOOKUP(J19,LINGUA!$B$523:$C$532,2,0)","v":"Reverse osmosis system 60 l / h - 230V 60Hz - for steel"},"AUC2000000",{"$f":"VLOOKUP(L19,LINGUA!$B$523:$C$542,2,0)","v":"AUTOCLAVE 200 Liters (expansion vessel)"}]
[{"$nulls":7},"UR040","80 l/h","ROC0606000",{"$f":"VLOOKUP(J20,LINGUA!$B$523:$C$532,2,0)","v":"Reverse osmosis system 60 l / h - 230V 60Hz - for steel"},"AUC2000000",{"$f":"VLOOKUP(L20,LINGUA!$B$523:$C$542,2,0)","v":"AUTOCLAVE 200 Liters (expansion vessel)"}]
[{"$nulls":5},{"$f":"MID(DESIGN!F110,1,2)","v":"UR"},null,"UR053","80 l/h","ROC0606000",{"$f":"VLOOKUP(J21,LINGUA!$B$523:$C$532,2,0)","v":"Reverse osmosis system 60 l / h - 230V 60Hz - for steel"},"AUC3000000",{"$f":"VLOOKUP(L21,LINGUA!$B$523:$C$542,2,0)","v":"AUTOCLAVE 300 Liters (expansion vessel)"}]
[{"$nulls":5},{"$f":"MID(DESIGN!F110,1,5)","v":"UR080"},null,"UR060","80 l/h","ROC0606000",{"$f":"VLOOKUP(J22,LINGUA!$B$523:$C$532,2,0)","v":"Reverse osmosis system 60 l / h - 230V 60Hz - for steel"},"AUC3000000",{"$f":"VLOOKUP(L22,LINGUA!$B$523:$C$542,2,0)","v":"AUTOCLAVE 300 Liters (expansion vessel)"}]
[{"$nulls":7},"UR080","100 l/h","ROL1006U00",{"$f":"VLOOKUP(J23,LINGUA!$B$523:$C$532,2,0)","v":"Reverse osmosis system 100 l / h - 230V 60Hz - for steel"},"AUC3000000",{"$f":"VLOOKUP(L23,LINGUA!$B$523:$C$542,2,0)","v":"AUTOCLAVE 300 Liters (expansion vessel)"}]
[]
[]
[{"$nulls":7},"Codice umidif",null,"Cod. Osmosi","Descrizione cod osmosi","Cod. Vaso espansione","descizione vaso di espansione"]
[{"$nulls":6},50,"UG045HD003",null,"ROL1005U00",{"$f":"LINGUA!C523","v":"Reverse osmosis system 100 l / h - 230V 50Hz - for steel"},"AUC2000000",{"$f":"VLOOKUP(J27,LINGUA!$B$523:$C$532,2,0)","v":"Reverse osmosis system 100 l / h - 230V 50Hz - for steel"}]
[{"$nulls":7},"UG090HD003",null,"ROL1005U00",{"$f":"LINGUA!C523","v":"Reverse osmosis system 100 l / h - 230V 50Hz - for steel"},"AUC2000000",{"$f":"VLOOKUP(J28,LINGUA!$B$523:$C$532,2,0)","v":"Reverse osmosis system 100 l / h - 230V 50Hz - for steel"}]
[{"$nulls":7},"UG180HD003",null,"ROL3205U00",{"$f":"LINGUA!C525","v":"Reverse osmosis system 320 l / h - 230V 50Hz - for steel"},"AUC2000000",{"$f":"VLOOKUP(J29,LINGUA!$B$523:$C$532,2,0)","v":"Reverse osmosis system 320 l / h - 230V 50Hz - for steel"}]
[{"$nulls":6},60,"UG045HD103",null,"ROL1006U00",{"$f":"LINGUA!C524","v":"Reverse osmosis system 100 l / h - 230V 60Hz - for steel"},"AUC2000000",{"$f":"VLOOKUP(J30,LINGUA!$B$523:$C$532,2,0)","v":"Reverse osmosis system 100 l / h - 230V 60Hz - for steel"}]
[{"$nulls":7},"UG090HD103",null,"ROL1006U00",{"$f":"LINGUA!C524","v":"Reverse osmosis system 100 l / h - 230V 60Hz - for steel"},"AUC2000000",{"$f":"VLOOKUP(J31,LINGUA!$B$523:$C$532,2,0)","v":"Reverse osmosis system 100 l / h - 230V 60Hz - for steel"}]
[{"$nulls":7},"UG180HD103",null,"ROL3206U00",{"$f":"LINGUA!C526","v":"Reverse osmosis system 320 l / h - 230V 60Hz - for steel"},"AUC2000000",{"$f":"VLOOKUP(J32,LINGUA!$B$523:$C$532,2,0)","v":"Reverse osmosis system 320 l / h - 230V 60Hz - for steel"}]
[]
[]
[{"$nulls":9},"ROL0605U00",{"$f":"LINGUA!C528","v":"Reverse osmosis system 60 l / h - 230V 60Hz - for steel"}]
[{"$nulls":9},"ROL0606U00",{"$f":"LINGUA!C529","v":"WTS compact 25 KG/H with pump"}]

{"sheet":"DP","index":12,"n_rows":121,"n_cols":53,"rows_kept":121,"hidden":true}
["Soluzione","Soluzione",null,null,"lunghezza DP","lunghezza DP","portata max DP","diametro in DP","Portata min per il DP","DP ha diametro = hum?","DP ci stà in condotta?","DP portata sufficiente?","Portata min per il DP","# DP da usare","Con raccordo?",null,null,"Con raccordo?","Quale raccordo?","Per tabella selection","#raccordi",null,null,{"$f":"MID(DESIGN!F110,1,5)","v":"UR080"},{"$f":"IF(AND(X1=Y12,DESIGN!D98=DP!Z12),2, HLOOKUP(X1,X4:BA6,3,0))","v":2},null,{"$f":"HLOOKUP(X1,Y56:BA57,2,0)","v":80},null,40,30]
[{"$f":"M2*J2*K2*L2*C2","v":0},{"$f":"J2*K2*L2*M2","v":0},1,"DP085D22R0",835,850,9,22,1.5,{"$f":"IF($X$2=H2,1,0)","v":0},{"$f":"IF(F2<=DESIGN!$E$75,1,0)","v":1},{"$f":"IF($AA$1<=G2,1,0)","v":0},{"$f":"IF(I2>$AA$1,0,1)","v":1},1,{"$nulls":5},{"$f":"IF(S2=0,\"\",S2)","v":""},{"$f":"N2/$Y$1","v":0.5},null,"diametro",{"$f":"HLOOKUP(X1,Y4:BA5,2,0)","v":40},{"$nulls":4},"UEKY40X400","UEKY000000"," "]
[{"$f":"M3*J3*K3*L3*C3","v":0},{"$f":"J3*K3*L3*M3","v":0},1,"DP060D22R0",597,600,9,22,1.5,{"$f":"IF($X$2=H3,1,0)","v":0},{"$f":"IF(F3<=DESIGN!$E$75,1,0)","v":1},{"$f":"IF($AA$1<=G3,1,0)","v":0},{"$f":"IF(I3>$AA$1,0,1)","v":1},1,{"$nulls":5},{"$f":"IF(S3=0,\"\",S3)","v":""},0.5]
[0,0,1,"DP045D22R0",438,450,6,22,1.5,0,{"$f":"IF(F4<=DESIGN!$E$75,1,0)","v":1},{"$f":"IF($AA$1<=G4,1,0)","v":0},{"$f":"IF(I4>$AA$1,0,1)","v":1},1,{"$nulls":5},"",0.5,{"$nulls":3},"UE001","UE003","UE005","UE008","UE009","UE010","UE015","UE018","UE025","UE035",null,"UE045","UE065","UE090","UE130","UR002","UR004","UR006","UR010","UR013","UR020","UR027","UR040","UR053","UR060","UR080","UG045","UG090","UG180"]
[0,0,1,"DP035D22R0",332,350,4,22,1.5,0,{"$f":"IF(F5<=DESIGN!$E$75,1,0)","v":1},0,1,1,{"$nulls":5},"",0.5,null,null,"diametro umidificatore:",22,22,30,30,30,30,30,30,40,40,null,40,{"$nulls":3},30,30,30,30,30,40,40,40,40,null,40]
[0,0,1,"DP165D30R0",1640,1650,18,30,10,0,{"$f":"IF(F6<=DESIGN!$E$75,1,0)","v":0},0,1,1,{"$nulls":5},"",0.5,null,null,"# uscite umidificatore",1,1,1,1,1,1,1,1,1,1,null,1,2,2,4,1,1,1,1,1,1,1,1,2,2,2,2,2,4]
[0,0,1,"DP125D30R0",1245,1250,18,30,5,0,{"$f":"IF(F7<=DESIGN!$E$75,1,0)","v":0},0,1,1,{"$nulls":5},"",0.5,{"$nulls":14},2]
[0,0,1,"DP105D30R0",1048,1050,18,30,5,0,{"$f":"IF(F8<=DESIGN!$E$75,1,0)","v":1},0,1,1,{"$nulls":5},"",0.5]
[0,0,1,"DP085D30R0",850,850,18,30,5,0,{"$f":"IF(F9<=DESIGN!$E$75,1,0)","v":1},0,1,1,{"$nulls":5},"",0.5,{"$nulls":3},"Gestione delle eccezioni"]
[0,0,1,"DP060D30R0",596,600,12,30,5,0,{"$f":"IF(F10<=DESIGN!$E$75,1,0)","v":1},0,1,1,{"$nulls":5},"",0.5,{"$nulls":3},"UE035","codice che può usare entrambi i raccordi; test nella riga 38, per diametro DP e tipo di raccordo)"]
[0,0,1,"DP045D30R0",427,450,8,30,5,0,{"$f":"IF(F11<=DESIGN!$E$75,1,0)","v":1},0,1,1,{"$nulls":5},"",0.5]
[0,0,1,"DP035D30R0",343,350,5,30,5,0,{"$f":"IF(F12<=DESIGN!$E$75,1,0)","v":1},0,1,1,{"$nulls":5},"",0.5,{"$nulls":3},"UE045",{"$f":"DESIGN!D98","v":"400V, 3phase"},null,"eccezione UE045"]
[{"$f":"M13*J13*K13*L13*C13","v":0},0,1,"DP205D40R0",2025,2050,45,40,35,1,{"$f":"IF(F13<=DESIGN!$E$75,1,0)","v":0},0,1,1,{"$nulls":4},{"$f":"IF(AND($X$1=$Y$12,$Z$12=$Z$13),$AC$2,0)","v":0},"",0.5,{"$nulls":4},"230V, 3phase"]
[0,0,1,"DP165D40R0",1636,1650,45,40,35,1,{"$f":"IF(F14<=DESIGN!$E$75,1,0)","v":0},0,1,1,{"$nulls":4},{"$f":"IF(AND($X$1=$Y$12,$Z$12=$Z$13),$AC$2,0)","v":0},"",0.5,{"$nulls":3},"UE025","codice che può usare entrambi i raccordi; test nella riga 38, per diametro DP e tipo di raccordo)"]
[0,0,1,"DP125D40R0",1222,1250,45,40,20,1,{"$f":"IF(F15<=DESIGN!$E$75,1,0)","v":0},0,1,1,{"$nulls":4},{"$f":"IF(AND($X$1=$Y$12,$Z$12=$Z$13),$AC$2,0)","v":0},"",0.5]
[0,0,1,"DP105D40R0",1015,1050,35,40,20,1,{"$f":"IF(F16<=DESIGN!$E$75,1,0)","v":1},0,1,1,{"$nulls":5},"",0.5]
[0,0,1,"DP085D40R0",834,850,25,40,20,1,{"$f":"IF(F17<=DESIGN!$E$75,1,0)","v":1},0,1,1,{"$nulls":5},"",0.5]
[0,0,1,"DP060D40RU",600,625,45,40,5,{"$f":"IF($X$2=H18,1,0)","v":1},{"$f":"IF(F18<=DESIGN!$E$75,1,0)","v":1},0,1,1,{"$nulls":4},{"$f":"IF(AND($X$1=$Y$12,$Z$12=$Z$13),$AC$2,0)","v":0},"",0.5]
[0,0,1,"DP060D30RU",600,625,15,30,4,{"$f":"IF($X$2=H19,1,0)","v":0},{"$f":"IF(F19<=DESIGN!$E$75,1,0)","v":1},0,1,1,{"$nulls":5},"",0.5]
[0,0,1,"DP045D30RU",450,475,15,30,2,{"$f":"IF($X$2=H20,1,0)","v":0},{"$f":"IF(F20<=DESIGN!$E$75,1,0)","v":1},0,1,1,{"$nulls":5},"",0.5]
[0,0,1,"DP030D30RU",300,330,15,30,2,{"$f":"IF($X$2=H21,1,0)","v":0},{"$f":"IF(F21<=DESIGN!$E$75,1,0)","v":1},0,{"$f":"IF(I21>$AA$1,0,1)","v":1},1,{"$nulls":5},"",0.5]
[0,0,1,"DP030D22RU",300,330,4,22,1.5,{"$f":"IF($X$2=H22,1,0)","v":0},{"$f":"IF(F22<=DESIGN!$E$75,1,0)","v":1},0,1,1,{"$nulls":5},"",0.5]
[0,0,{"$f":"IF(AND(B2=0,B23=1),1,0)","v":0},"DP085D22R0",835,850,9,22,200,{"$f":"IF($X$27=H23,1,0)","v":0},{"$f":"IF(F23<=DESIGN!$E$75,1,0)","v":1},{"$f":"IF($AA$1<=G23*N23,1,0)","v":0},0,2,{"$f":"IF($Y$1<N23,1,0)","v":0},null,{"$f":"IF(AND(A2=0,A23=1),1,0)","v":0},{"$f":"O23*Q23","v":0},{"$f":"IF(R23=0,0,IF(AND($X$2=$AC$1,$X$27=$AD$1),$AD$2,IF(AND($X$2=$AC$1,$X$27=$AC$1),$AC$2,0)))","v":0},"",1]
[0,0,0,"DP060D22R0",597,600,9,22,200,0,{"$f":"IF(F24<=DESIGN!$E$75,1,0)","v":1},{"$f":"IF($AA$1<=G24*N24,1,0)","v":0},0,2,{"$f":"IF($Y$1<N24,1,0)","v":0},null,0,0,0,"",1]
[0,0,0,"DP045D22R0",438,450,6,22,200,0,{"$f":"IF(F25<=DESIGN!$E$75,1,0)","v":1},0,0,2,0,null,0,0,0,"",1]
[0,0,0,"DP035D22R0",332,350,4,22,200,0,{"$f":"IF(F26<=DESIGN!$E$75,1,0)","v":1},0,0,2,0,null,0,0,0,"",1]
[0,0,0,"DP165D30R0",1640,1650,18,30,{"$f":"I6*J27","v":0},0,{"$f":"IF(F27<=DESIGN!$E$75,1,0)","v":0},0,1,2,0,null,0,0,0,"",1,null,"diametro",{"$f":"HLOOKUP(X1,Y28:BA29,2,0)","v":40}]
[0,0,0,"DP125D30R0",1245,1250,18,30,20,0,{"$f":"IF(F28<=DESIGN!$E$75,1,0)","v":0},0,1,2,0,null,0,0,0,"",1,{"$nulls":3},"UE001","UE003","UE005","UE008","UE009","UE010","UE015","UE018","UE025","UE035",null,"UE045","UE065","UE090","UE130","UR002","UR004","UR006","UR010","UR013","UR020","UR027","UR040","UR053","UR060","UR080","UG045","UG090","UG180"]
[0,0,0,"DP105D30R0",1048,1050,18,30,20,0,{"$f":"IF(F29<=DESIGN!$E$75,1,0)","v":1},0,1,2,0,null,0,0,0,"",1,null,null,"diametro umidificatore:",{"$nulls":8},30,30,null,40,40,40,40,{"$nulls":4},30,30,30,40,40,40,40,40,40]
[{"$f":"M30*J30*K30*L30*C30","v":0},0,0,"DP085D30R0",850,850,18,30,20,0,{"$f":"IF(F30<=DESIGN!$E$75,1,0)","v":1},0,1,2,0,null,0,0,0,"",1]
[0,0,0,"DP060D30R0",596,600,12,30,20,0,{"$f":"IF(F31<=DESIGN!$E$75,1,0)","v":1},0,1,2,0,null,0,0,0,"",1]
[0,0,0,"DP045D30R0",427,450,8,30,200,0,{"$f":"IF(F32<=DESIGN!$E$75,1,0)","v":1},0,{"$f":"IF(I32>$AA$1,0,1)","v":0},2,0,null,0,0,0,"",1]
[0,0,0,"DP035D30R0",343,350,5,30,200,0,{"$f":"IF(F33<=DESIGN!$E$75,1,0)","v":1},0,0,2,0,null,0,0,0,"",1]
[0,0,0,"DP205D40R0",2025,2050,45,40,65,1,{"$f":"IF(F34<=DESIGN!$E$75,1,0)","v":0},1,1,2,0,null,0,0,0,"",{"$f":"N34/$Y$1","v":1}]
[0,0,0,"DP165D40R0",1636,1650,45,40,45,1,{"$f":"IF(F35<=DESIGN!$E$75,1,0)","v":0},1,1,2,0,null,0,0,0,"",1]
[0,0,0,"DP125D40R0",1222,1250,45,40,45,1,{"$f":"IF(F36<=DESIGN!$E$75,1,0)","v":0},1,1,2,0,null,0,0,0,"",{"$f":"N36/$Y$1","v":1}]
[0,0,0,"DP105D40R0",1015,1050,35,40,40,1,{"$f":"IF(F37<=DESIGN!$E$75,1,0)","v":1},0,1,2,0,null,0,0,{"$f":"IF(AND(X1=Y12,Z12=Z13),0,IF(R37=0,0,IF(AND($X$2=$AC$1,$X$27=$AD$1),$AD$2,IF(AND($X$2=$AC$1,$X$27=$AC$1),$AC$2,0))))","v":0},"",1]
[0,0,0,"DP085D40R0",834,850,25,40,35,{"$f":"IF(X1=Y10,1,IF($X$27=H38,1,0))","v":1},{"$f":"IF(F38<=DESIGN!$E$75,1,0)","v":1},{"$f":"IF($AA$1<=G38*N38,1,0)","v":0},1,2,0,null,0,0,{"$f":"IF(AND(X1=Y12,Z12=Z13),0,IF(X1=Y10,AC2,IF(R38=0,0,IF(AND($X$2=$AC$1,$X$27=$AD$1),$AD$2,IF(AND($X$2=$AC$1,$X$27=$AC$1),$AC$2,0)))))","v":0},"",1]
[1,1,1,"DP060D40RU",600,625,45,40,45,{"$f":"IF($X$27=H39,1,0)","v":1},{"$f":"IF(F39<=DESIGN!$E$75,1,0)","v":1},1,1,2,0,null,1,0,{"$f":"IF(R39=0,0,IF(AND($X$2=$AC$1,$X$27=$AD$1),$AD$2,IF(AND($X$2=$AC$1,$X$27=$AC$1),$AC$2,0)))","v":0},"",1]
[0,0,0,"DP060D30RU",600,625,15,30,20,{"$f":"IF($X$27=H40,1,0)","v":0},{"$f":"IF(F40<=DESIGN!$E$75,1,0)","v":1},0,1,2,0,null,0,0,{"$f":"IF(X1=Y14,AC2,IF(R40=0,0,IF(AND($X$2=$AC$1,$X$27=$AD$1),$AD$2,IF(AND($X$2=$AC$1,$X$27=$AC$1),$AC$2,0))))","v":0},"",1]
[0,0,0,"DP045D30RU",450,475,15,30,20,{"$f":"IF($X$27=H41,1,0)","v":0},{"$f":"IF(F41<=DESIGN!$E$75,1,0)","v":1},0,1,2,0,null,0,0,{"$f":"IF(R41=0,0,IF(AND($X$2=$AC$1,$X$27=$AD$1),$AD$2,IF(AND($X$2=$AC$1,$X$27=$AC$1),$AC$2,0)))","v":0},"",1]
[{"$f":"M42*J42*K42*L42*C42","v":0},0,0,"DP030D30RU",300,330,15,30,200,{"$f":"IF($X$27=H42,1,0)","v":0},{"$f":"IF(F42<=DESIGN!$E$75,1,0)","v":1},0,0,2,0,null,0,0,{"$f":"IF(R42=0,0,IF(AND($X$2=$AC$1,$X$27=$AD$1),$AD$2,IF(AND($X$2=$AC$1,$X$27=$AC$1),$AC$2,0)))","v":0},"",1]
[0,0,0,"DP030D22RU",300,330,4,22,200,{"$f":"IF($X$27=H43,1,0)","v":0},{"$f":"IF(F43<=DESIGN!$E$75,1,0)","v":1},0,0,2,0,null,0,0,{"$f":"IF(R43=0,0,IF(AND($X$2=$AC$1,$X$27=$AD$1),$AD$2,IF(AND($X$2=$AC$1,$X$27=$AC$1),$AC$2,0)))","v":0},"",1,null,null,{"$f":"HLOOKUP(X1,X44:BA45,2,0)","v":40}]
[0,0,0,"DP085D22R0",835,850,9,22,200,{"$f":"IF($X$43=H44,1,0)","v":0},{"$f":"IF(F44<=DESIGN!$E$75,1,0)","v":1},0,{"$f":"IF(I44>$AA$1,0,1)","v":0},4,1,null,0,0,{"$f":"IF(R44=1,IF(O44=1,IF($X$43=$AD$1,$AD$2,IF($X$43=$AC$1,$AC$2,0))),0)","v":0},"",2,{"$nulls":3},"UE001","UE003","UE005","UE008","UE009","UE010","UE015","UE018","UE025","UE035",null,"UE045","UE065","UE090","UE130","UR002","UR004","UR006","UR010","UR013","UR020","UR027","UR040","UR053","UR060","UR080","UG045","UG090","UG180"]
[0,0,0,"DP060D22R0",597,600,9,22,200,0,{"$f":"IF(F45<=DESIGN!$E$75,1,0)","v":1},0,0,4,1,null,0,{"$f":"O45*Q45","v":0},0,"",2,null,null,"diametro umidificatore:",{"$nulls":12},40,40,40,{"$nulls":4},30,{"$nulls":3},40,40,40,null,40,40]
[0,0,0,"DP045D22R0",438,450,6,22,200,0,{"$f":"IF(F46<=DESIGN!$E$75,1,0)","v":1},0,0,4,1,null,0,0,0,"",2]
[0,0,0,"DP035D22R0",332,350,4,22,200,0,{"$f":"IF(F47<=DESIGN!$E$75,1,0)","v":1},0,0,4,1,null,0,0,0,"",2]
[0,0,0,"DP165D30R0",1640,1650,18,30,200,0,{"$f":"IF(F48<=DESIGN!$E$75,1,0)","v":0},0,0,4,1,null,0,0,0,{"$f":"IF(S48=0,\"\",S48)","v":""},2]
[0,0,0,"DP125D30R0",1245,1250,18,30,200,0,{"$f":"IF(F49<=DESIGN!$E$75,1,0)","v":0},0,0,4,1,null,0,0,0,"",2]
[0,0,0,"DP105D30R0",1048,1050,18,30,200,0,{"$f":"IF(F50<=DESIGN!$E$75,1,0)","v":1},0,0,4,1,null,0,0,0,"",2]
[0,0,0,"DP085D30R0",850,850,18,30,200,0,{"$f":"IF(F51<=DESIGN!$E$75,1,0)","v":1},0,0,4,1,null,0,0,0,"",2]
[0,0,0,"DP060D30R0",596,600,12,30,200,0,{"$f":"IF(F52<=DESIGN!$E$75,1,0)","v":1},0,0,4,1,null,0,0,0,"",2]
[0,0,0,"DP045D30R0",427,450,8,30,200,0,{"$f":"IF(F53<=DESIGN!$E$75,1,0)","v":1},0,0,4,1,null,0,0,0,"",2]
[0,0,0,"DP035D30R0",343,350,5,30,200,0,{"$f":"IF(F54<=DESIGN!$E$75,1,0)","v":1},0,0,4,1,null,0,0,0,"",2]
[0,0,0,"DP205D40R0",2025,2050,45,40,130,1,{"$f":"IF(F55<=DESIGN!$E$75,1,0)","v":0},1,0,4,1,null,0,{"$f":"O55*Q55","v":0},0,"",2]
[0,0,0,"DP165D40R0",1636,1650,45,40,130,1,{"$f":"IF(F56<=DESIGN!$E$75,1,0)","v":0},1,0,4,1,null,0,0,0,"",2,{"$nulls":3},"UE001","UE003","UE005","UE008","UE009","UE010","UE015","UE018","UE025","UE035",null,"UE045","UE065","UE090","UE130","UR002","UR004","UR006","UR010","UR013","UR020","UR027","UR040","UR053","UR060","UR080","UG045","UG090","UG180"]
[0,0,0,"DP125D40R0",1222,1250,45,40,130,1,{"$f":"IF(F57<=DESIGN!$E$75,1,0)","v":0},1,0,4,1,null,0,0,0,"",2,null,null,"portate",1.5,3,5,8,9,10,15,18,25,35,null,45,65,90,130,2,4,6,10,13,20,27,40,53,60,80,45,90,180]
[0,0,0,"DP105D40R0",1015,1050,35,40,90,1,{"$f":"IF(F58<=DESIGN!$E$75,1,0)","v":1},1,0,4,1,null,0,0,0,"",2]
[1,1,1,"DP085D40R0",834,850,25,40,60,1,{"$f":"IF(F59<=DESIGN!$E$75,1,0)","v":1},1,1,4,1,null,1,1,"UEKY40X400","UEKY40X400",2]
[0,0,0,"DP060D40RU",600,625,45,40,130,1,{"$f":"IF(F60<=DESIGN!$E$75,1,0)","v":1},1,0,4,1,null,0,{"$f":"O60*Q60","v":0},0,"",2]
[0,0,0,"DP060D30RU",600,625,15,30,200,0,{"$f":"IF(F61<=DESIGN!$E$75,1,0)","v":1},0,0,4,1,null,0,{"$f":"O61*Q61","v":0},0,{"$f":"IF(S61=0,\"\",S61)","v":""},2]
[0,0,0,"DP045D30RU",450,475,15,30,200,0,{"$f":"IF(F62<=DESIGN!$E$75,1,0)","v":1},0,{"$f":"IF(I62>$AA$1,0,1)","v":0},4,1,null,0,{"$f":"O62*Q62","v":0},0,"",2]
[0,0,0,"DP030D30RU",300,330,15,30,200,0,{"$f":"IF(F63<=DESIGN!$E$75,1,0)","v":1},0,0,4,1,null,0,{"$f":"O63*Q63","v":0},0,"",2]
[0,0,0,"DP030D22RU",300,330,4,22,200,0,{"$f":"IF(F64<=DESIGN!$E$75,1,0)","v":1},0,{"$f":"IF(I64>$AA$1,0,1)","v":0},4,1,null,0,{"$f":"O64*Q64","v":0},0,"",2]
{"$rows_empty":49}
[{"$nulls":20},{"$f":"N114/$Y$1","v":0}]
[{"$nulls":20},0]
[{"$nulls":20},0]
[{"$nulls":20},0]
[{"$nulls":20},0]
[{"$nulls":20},0]
[{"$nulls":20},0]
[{"$nulls":20},0]

{"sheet":"release","index":13,"n_rows":4,"n_cols":3,"rows_kept":4,"hidden":true}
["from 4.01 to 4.03"]
[]
["sheet","cells","description"]
["sheet CODICI:","B274-B435","changed version of UR*. From UR*2 to UR*3"]